program: Gaussian 09
title: 000070937
version: EM64L-G09RevD.01
frameworkgroup: C1[X(C5H8ClNO)]
method: RPBEPBE
basis: SDD
operation: Freq
keyword: #p
keyword: freq=noraman
keyword: PBEPBE/SDD
title: #p freq=noraman PBEPBE/SDD
converged: NO YES NO NO
title: Mulliken charges:
elementType: Cl O N C C C C C H H H H H H H H
charge: -0.125021 -0.176016 -0.071843 -0.443180 -0.441791 -0.354831 -0.360870 0.022496 0.230177 0.238089 0.230909 0.237692 0.261446 0.246996 0.261009 0.244738
chargesum: 0.00000
title: Mulliken charges with hydrogens summed into heavy atoms:
elementType: Cl O N C C C C C
charge: -0.125021 -0.176016 -0.071843 0.025086 0.026810 0.153610 0.144877 0.022496
polarizability: 8.76867230e+01 3.31368013e+00 7.75239113e+01 -5.24735064e-01 -1.04511648e+00 4.63216876e+01
1716.lowfreq: -16.7851 -7.4280 -0.0037 -0.0032 -0.0031 11.6151 67.7458 97.4814 180.4161
frequency: 67.7394 97.4470 180.3886 228.7324 236.2865 310.8267 372.7189 521.5978 567.2655 609.8357 695.5214 811.6680 858.9416 863.0726 916.2647 922.0419 984.4437 1062.0573 1112.7867 1143.8300 1162.6801 1177.0231 1219.8360 1242.8208 1303.1829 1309.4835 1318.3642 1333.4121 1347.9437 1467.9125 1472.1618 1485.5553 1492.9519 1741.3535 3002.6309 3008.5866 3017.8726 3019.1718 3075.6768 3082.4697 3090.1075 3103.1547
redmass: 2.7063 4.1475 6.3745 2.1176 2.1369 7.0247 16.3675 6.3734 1.8825 10.1761 3.7019 2.1253 2.2077 2.1178 2.4268 1.3504 1.8483 1.9104 1.5393 3.8609 1.4659 1.4458 1.3168 1.2659 1.7018 1.6395 1.4018 1.5518 1.8520 1.0874 1.0893 1.0780 1.0891 12.2518 1.0632 1.0642 1.0654 1.0622 1.1005 1.0993 1.1024 1.1060
irintensity: 0.8699 0.6029 1.3538 1.9696 2.1397 29.2998 11.7639 5.9963 4.1603 10.1978 56.7220 62.9746 4.0363 10.4199 7.3214 3.2107 3.9164 7.5879 5.1070 54.0295 5.4596 8.1291 19.3836 16.8943 51.0997 78.3633 21.0343 37.2268 37.3378 10.3590 17.5600 6.4250 3.9848 444.7110 35.1128 12.4705 24.6511 26.5013 13.2515 12.0128 14.2474 58.7501
temp: 298.150 k
press: 1.00000 atm
elementType: 17 8 7 6 6 6 6 6 1 1 1 1 1 1 1 1
symmnumber: 1
zpe: 335180.6 jmol-1
zpe.correction: 0.127664 hartree
zpe.thermalcorrener: 0.135604 hartree
zpe.thermalcorrenthalpy: 0.136549 hartree
zpe.thermalcorrgfe: 0.094233 hartree
zpe.sumelectzpe: -784.754486 hartree
zpe.sumelectthermal: -784.746545 hartree
zpe.sumelectthermalent: -784.745600 hartree
zpe.sumelectthermalfe: -784.787916 hartree
dipole: 5.6587 -1.6958 0.0306
dipole: 5.9074
quadrupole: -57.7297 -56.8599 -53.2556
quadrupole: 3.0771 -0.0782 0.2780
quadrupole: -1.7813 -0.9115 2.6928 3.0771 -0.0782 0.2780
hfenergy: -784.8821491 hartree
pointgroup: C01 [X(C5H8Cl1N1O1)]
dipole: -2.3129459 0.2279332 -0.0041363 debye
dipolederiv: -0.4825216 -0.328528 -0.0291127 -0.3994797 -0.825193 -0.0589146 -0.0410927 -0.0587737 -0.1715059 -0.8305774 0.2643537 0.0159295 0.3798696 -1.1230659 -0.061176 0.0189114 -0.0535279 -0.2978408 -1.4001701 0.0065762 -0.0178457 -0.0740156 -0.5570786 -0.070782 -0.0232616 -0.0149877 -0.2844292 0.0269596 -0.0471498 -0.0203243 -0.0161056 0.0248132 0.035746 0.0411219 0.0037307 0.1490968 0.0271287 0.0317972 0.0295705 -0.0070591 0.001779 0.0296826 -0.0390674 -0.0089338 0.1411223 0.277403 -0.1577389 -0.0462314 -0.2214296 0.2959729 0.0346062 0.0064216 0.0622728 0.2888366 0.3121449 0.1669437 0.05895 0.2728791 0.3109989 0.0304605 0.0106643 0.0677651 0.2973052 1.9935093 0.06817 0.0346597 0.0647236 1.8126718 0.1324955 0.0413488 0.1213384 0.2463365 0.0547031 -0.0158527 -0.0195939 -0.0349118 0.0590246 -0.0051525 -0.0693431 0.0315694 -0.1512767 -0.036728 0.0961242 0.0444303 0.1192911 -0.0203081 -0.0454606 0.0688609 -0.0673572 0.0571156 0.0679951 0.0166644 0.0072481 0.0327854 0.0542524 -0.0074858 0.0612137 0.0252521 -0.1525 -0.0771126 -0.1031785 -0.0470918 -0.1093359 0.0129284 -0.0326099 -0.0687837 -0.0503046 0.0630974 0.0269791 -0.0611065 0.0517364 0.0106074 -0.0261928 0.0571938 0.0360708 0.0699867 0.0093619 0.0165884 0.0127145 -0.0236303 0.0694913 0.001101 -0.0495624 -0.0114007 -0.0987842 -0.1002727 0.0229238 0.0697019 -0.0488123 -0.0134034 -0.0341749 0.0628904 -0.0226072 0.0733877 0.0167053 0.0007749 -0.0194915 0.0101178 -0.0739069 0.012471 -0.0519311 -0.0090569 -0.1026337 -0.1111522 unknown
polarizability: 86.0558726|4.9539793|79.0689129|0.8081263|1.9694605|46.4075364 unknown
InChI: InChI=1S/C5H8ClNO/c6-5(8)7-3-1-2-4-7/h1-4H2
charge 0 multiplicity 1
16 atoms
Cl 2.371089 1.411967 0.130247
O  2.038172 -1.320294 -0.08738
N  0.069705 -0.052487 -0.029394
C  -2.128084 0.833586 -0.243666
C  -2.222923 -0.621082 0.283817
C  -0.664459 1.242406 0.049221
C  -0.853708 -1.230024 -0.088804
C  1.411301 -0.252172 -0.022906
H  -2.315887 0.85595 -1.332246
H  -2.846746 1.513335 0.242367
H  -2.353337 -0.623876 1.380883
H  -3.058893 -1.183401 -0.163354
H  -0.260938 1.962333 -0.680236
H  -0.551882 1.67837 1.058963
H  -0.508781 -2.013027 0.606907
H  -0.849228 -1.653184 -1.110918
