program: Orca
programVersion: 5.0.2
elementType: Cl O N N N C C C C C C C C C C C C C C C C C H H H H H H H H H H H H H H H H H H H H H H H
charge: 1
multiplicity: 1
keywords: wb97x-d3
keywords: def2-TZVPP
keywords: def2/J RIJCOSX
keywords: DEFGRID2
keywords: scfconv7
keywords: smallprint printgap noloewdin
keywords: NOSOSCF
formula: C17H23ClN3O
InChI: InChI=1/C17H23ClN3O/c1-16(2)8-7-14(9-13-3-5-15(18)6-4-13)17(16,22)10-21-12-19-11-20-21/h3-6,11-12,14,20,22H,7-10H2,1-2H3
45 atoms
Cl -5.23246 -0.81892 0.706502
O  0.468695 0.064951 1.067619
N  1.235515 2.119988 -0.609247
N  0.331414 2.564819 0.267367
N  1.29931 4.304712 -0.599837
C  1.511158 -0.269733 0.177071
C  2.928732 -0.258453 0.829652
C  1.405523 -1.713267 -0.367498
C  3.765597 -1.043303 -0.194872
C  2.808568 -2.023687 -0.900354
C  1.370629 0.716265 -0.992273
C  0.293472 -2.043016 -1.367012
C  2.899319 -1.003589 2.169983
C  3.515856 1.125307 1.090342
C  -1.09745 -1.754121 -0.869595
C  1.798185 3.199428 -1.12909
C  -1.615122 -2.430168 0.234552
C  -1.901894 -0.801983 -1.486962
C  -2.881326 -2.15273 0.723465
C  -3.173702 -0.508413 -1.013559
C  0.396153 3.882556 0.26844
C  -3.650761 -1.183387 0.096437
H  1.22884 -2.342685 0.510812
H  4.600278 -1.551821 0.290194
H  4.20851 -0.358772 -0.922451
H  2.84476 -1.884134 -1.983346
H  3.069904 -3.065806 -0.716392
H  0.485399 0.485587 -1.58211
H  2.229065 0.675101 -1.66046
H  0.379141 -3.110499 -1.592011
H  0.462598 -1.532402 -2.318426
H  2.534682 -2.029125 2.09606
H  3.91186 -1.060266 2.571551
H  2.293586 -0.48462 2.915438
H  4.469112 1.024262 1.613007
H  3.730148 1.674722 0.173515
H  2.872172 1.738118 1.725717
H  0.306419 -0.656322 1.685941
H  2.563446 3.140366 -1.887392
H  -1.022325 -3.191253 0.728729
H  -0.180146 1.900383 0.848797
H  -3.262661 -2.687467 1.58336
H  -3.78011 0.23772 -1.509874
H  -0.219352 4.494518 0.908323
H  -1.538841 -0.274712 -2.361683
elementType: Cl O N C H
totalener: -1361.29132397 hartree
nucrepener: 2052.06492179 hartree
electener: -3413.35624575 hartree
oneelecener: -5912.98023354 hartree
twoeener: 2499.62398778 hartree
cpcmener: -0.10117501 hartree
kineticenergy: 1356.44368275 hartree
xcener: -110.347516397455 hartree
chargesum: 1.0000000
charge: -0.099259 -0.434646 0.085199 -0.032759 -0.360491 0.458301 0.271366 -0.119223 -0.250217 -0.183538 -0.275222 -0.124965 -0.371158 -0.360383 0.088271 0.173646 -0.278821 -0.236894 -0.126955 -0.142594 0.187537 0.079725 0.098110 0.084721 0.091828 0.087191 0.090769 0.178724 0.155277 0.114239 0.092752 0.112713 0.100738 0.097286 0.112139 0.084814 0.102014 0.224667 0.195747 0.143306 0.249922 0.144126 0.143775 0.200480 0.147744
qa: -0.0993 -0.4346 0.0852 -0.0328 -0.3605 0.4583 0.2714 -0.1192 -0.2502 -0.1835 -0.2752 -0.1250 -0.3712 -0.3604 0.0883 0.1736 -0.2788 -0.2369 -0.1270 -0.1426 0.1875 0.0797 0.0981 0.0847 0.0918 0.0872 0.0908 0.1787 0.1553 0.1142 0.0928 0.1127 0.1007 0.0973 0.1121 0.0848 0.1020 0.2247 0.1957 0.1433 0.2499 0.1441 0.1438 0.2005 0.1477
va: 1.2056 1.9661 3.4091 3.4538 3.0532 3.7301 3.7108 3.9783 3.9821 3.9106 3.9128 3.7955 3.9366 3.9244 3.4962 3.9748 3.9924 3.9705 3.9642 3.9773 3.9566 3.8466 1.0075 1.0123 1.0041 1.0071 1.0108 0.9917 0.9874 1.0003 1.0057 0.9960 1.0056 1.0088 1.0050 1.0028 1.0055 1.0188 0.9814 1.0039 1.0050 1.0043 1.0057 0.9748 1.0004
dispersion: -0.027315250 hartree
energy: -1361.318639216775 hartree
dipole: 37.54867 -34.58805 2.96062 -6.51455 8.27485 1.76031 0.28371 -0.67891 -0.39519
magnitude: 3.46700 au
magnitude: 8.81243 debye
