program: Orca
programVersion: 5.0.2
elementType: Cl O N N N C C C C C C C C C C C C C C C C C H H H H H H H H H H H H H H H H H H H H H H H
charge: 1
multiplicity: 1
keywords: wb97x-d3
keywords: def2-TZVPP
keywords: def2/J RIJCOSX
keywords: DEFGRID2
keywords: scfconv7
keywords: smallprint printgap noloewdin
keywords: NOSOSCF
formula: C17H23ClN3O
InChI: InChI=1/C17H23ClN3O/c1-16(2)8-7-14(9-13-3-5-15(18)6-4-13)17(16,22)10-21-12-19-11-20-21/h3-6,11-12,14,20,22H,7-10H2,1-2H3
45 atoms
Cl 5.1217 4.268842 -0.489497
O  -1.321768 -1.283608 1.99804
N  -1.9718 -3.168856 0.005868
N  -2.427061 -3.638495 1.170551
N  -3.503404 -4.675214 -0.412434
C  -1.249155 -0.870555 0.637835
C  -2.548972 -0.129339 0.193609
C  -0.10506 0.190744 0.479736
C  -2.270256 1.287794 0.716366
C  -0.815565 1.552197 0.353605
C  -0.926068 -2.158831 -0.110819
C  0.91578 -0.039429 -0.644272
C  -3.854173 -0.674464 0.76751
C  -2.671529 -0.090796 -1.33273
C  1.978448 1.024048 -0.629684
C  -2.638718 -3.817227 -0.933818
C  2.959715 1.028599 0.360129
C  1.996845 2.042928 -1.57684
C  3.928564 2.0180 0.411866
C  2.958295 3.04379 -1.542851
C  -3.356593 -4.532953 0.894534
C  3.916664 3.02234 -0.544343
H  0.453967 0.156058 1.418443
H  -2.4157 1.332822 1.801176
H  -2.957808 2.017599 0.285027
H  -0.749048 1.921848 -0.672239
H  -0.356705 2.310659 0.987519
H  -0.003095 -2.598902 0.269257
H  -0.801349 -1.99496 -1.177442
H  0.420121 -0.039461 -1.61763
H  1.39617 -1.013918 -0.527654
H  -4.133543 -1.64426 0.353188
H  -3.840383 -0.757702 1.854276
H  -4.664871 0.011241 0.513294
H  -1.762791 0.241168 -1.835057
H  -2.939169 -1.06327 -1.749549
H  -3.465309 0.603261 -1.614323
H  -1.640851 -0.559861 2.550042
H  -2.459781 -3.649709 -1.984044
H  2.973205 0.243487 1.10707
H  1.249912 2.060069 -2.361059
H  4.682699 2.003181 1.187317
H  2.955416 3.82743 -2.288533
H  -3.89975 -5.056278 1.664408
H  -2.121433 -3.221448 2.04839
elementType: Cl O N C H
totalener: -1361.28923506 hartree
nucrepener: 1978.50358828 hartree
electener: -3339.79282334 hartree
oneelecener: -5766.61785569 hartree
twoeener: 2426.82503235 hartree
cpcmener: -0.11916189 hartree
kineticenergy: 1356.43805859 hartree
xcener: -110.342880469720 hartree
chargesum: 1.0000000
charge: -0.106841 -0.451953 0.086436 -0.032650 -0.365359 0.401601 0.243522 -0.096159 -0.243907 -0.180153 -0.181025 -0.077113 -0.353101 -0.389597 -0.017914 0.168018 -0.215838 -0.194125 -0.168436 -0.175517 0.192491 0.109589 0.082910 0.087856 0.083706 0.090789 0.090457 0.164696 0.144421 0.109793 0.105906 0.086619 0.099257 0.111050 0.114858 0.100888 0.105811 0.240357 0.195104 0.144926 0.144487 0.144384 0.143585 0.202757 0.253415
qa: -0.1068 -0.4520 0.0864 -0.0327 -0.3654 0.4016 0.2435 -0.0962 -0.2439 -0.1802 -0.1810 -0.0771 -0.3531 -0.3896 -0.0179 0.1680 -0.2158 -0.1941 -0.1684 -0.1755 0.1925 0.1096 0.0829 0.0879 0.0837 0.0908 0.0905 0.1647 0.1444 0.1098 0.1059 0.0866 0.0993 0.1110 0.1149 0.1009 0.1058 0.2404 0.1951 0.1449 0.1445 0.1444 0.1436 0.2028 0.2534
va: 1.1980 1.9862 3.4011 3.4604 3.0344 3.7900 3.7609 3.8726 3.9858 3.9039 3.8264 3.7395 3.9332 3.9491 3.5712 3.9829 3.9775 3.9506 4.0004 4.0173 3.9489 3.8063 1.0416 1.0121 1.0186 1.0044 1.0134 1.0004 0.9832 1.0013 1.0125 1.0021 1.0141 1.0028 1.0003 1.0017 1.0053 1.0057 0.9817 1.0038 1.0048 1.0061 1.0065 0.9745 0.9934
dispersion: -0.026312678 hartree
energy: -1361.315547740759 hartree
dipole: -29.78605 25.39450 -4.39155 -10.37251 5.25244 -5.12007 1.17394 0.07976 1.25370
magnitude: 6.86094 au
magnitude: 17.43914 debye
