program: Orca
programVersion: 5.0.2
elementType: Cl O N N N C C C C C C C C C C C C C C C C C H H H H H H H H H H H H H H H H H H H H H H H
charge: 1
multiplicity: 1
keywords: wb97x-d3
keywords: def2-TZVPP
keywords: def2/J RIJCOSX
keywords: DEFGRID2
keywords: scfconv7
keywords: smallprint printgap noloewdin
keywords: NOSOSCF
formula: C17H23ClN3O
InChI: InChI=1/C17H23ClN3O/c1-16(2)8-7-14(9-13-3-5-15(18)6-4-13)17(16,22)10-21-12-19-11-20-21/h3-6,11-12,14,20,22H,7-10H2,1-2H3
45 atoms
Cl 5.54901 2.067901 -0.173631
O  -2.518517 -1.089765 1.757648
N  -1.552815 -2.505265 -0.472213
N  -1.256818 -3.193973 0.634243
N  -0.072783 -4.033536 -0.988296
C  -2.282175 -0.368131 0.550725
C  -3.243808 0.874195 0.423048
C  -0.854825 0.225816 0.586886
C  -2.368932 2.069346 0.89119
C  -1.068909 1.481128 1.435576
C  -2.528726 -1.417459 -0.526902
C  -0.251516 0.577653 -0.784163
C  -4.480155 0.725835 1.309069
C  -3.730369 1.110409 -1.009739
C  1.195132 0.960989 -0.656651
C  -0.822915 -3.038715 -1.437927
C  1.603277 2.289569 -0.707585
C  2.164648 -0.02016 -0.457463
C  2.938615 2.640312 -0.561086
C  3.502602 0.308513 -0.307488
C  -0.358696 -4.100781 0.301631
C  3.877172 1.642821 -0.359564
H  -0.178501 -0.481662 1.076599
H  -2.886463 2.679019 1.633319
H  -2.151573 2.728139 0.047342
H  -0.232526 2.178606 1.376897
H  -1.16646 1.222305 2.493825
H  -2.447318 -1.016316 -1.532381
H  -3.525046 -1.849784 -0.420593
H  -0.802124 1.393292 -1.254886
H  -0.317039 -0.270288 -1.468077
H  -5.058856 -0.166997 1.064357
H  -4.238881 0.693384 2.371664
H  -5.133303 1.586942 1.157549
H  -4.407307 0.325011 -1.35191
H  -4.284767 2.049379 -1.049291
H  -2.91543 1.191452 -1.729877
H  -2.263693 -0.560991 2.522582
H  -0.869014 -2.684273 -2.455291
H  0.869632 3.070334 -0.867787
H  1.870999 -1.063751 -0.422465
H  3.236588 3.679154 -0.604682
H  4.241433 -0.46664 -0.154972
H  0.061396 -4.786013 1.019808
H  -1.643826 -2.900362 1.531599
elementType: Cl O N C H
totalener: -1361.28744571 hartree
nucrepener: 2015.76325563 hartree
electener: -3377.05070134 hartree
oneelecener: -5840.45847161 hartree
twoeener: 2463.40777028 hartree
cpcmener: -0.11985860 hartree
kineticenergy: 1356.43541722 hartree
xcener: -110.341173734468 hartree
chargesum: 1.0000000
charge: -0.106098 -0.453082 0.094143 -0.036005 -0.371502 0.401938 0.076116 0.051924 -0.146030 -0.253860 -0.162064 -0.133096 -0.338087 -0.383913 0.028856 0.154041 -0.247443 -0.239584 -0.140890 -0.155833 0.192303 0.095011 0.102001 0.079051 0.085435 0.093620 0.088270 0.148239 0.162354 0.117880 0.106887 0.097556 0.096139 0.102169 0.102732 0.108789 0.108308 0.237114 0.196702 0.149007 0.149963 0.143742 0.141879 0.202060 0.253253
qa: -0.1061 -0.4531 0.0941 -0.0360 -0.3715 0.4019 0.0761 0.0519 -0.1460 -0.2539 -0.1621 -0.1331 -0.3381 -0.3839 0.0289 0.1540 -0.2474 -0.2396 -0.1409 -0.1558 0.1923 0.0950 0.1020 0.0791 0.0854 0.0936 0.0883 0.1482 0.1624 0.1179 0.1069 0.0976 0.0961 0.1022 0.1027 0.1088 0.1083 0.2371 0.1967 0.1490 0.1500 0.1437 0.1419 0.2021 0.2533
va: 1.1982 1.9815 3.3850 3.4561 3.0160 3.7682 3.8640 3.9114 3.8605 4.0402 3.8476 3.7313 3.9575 3.9488 3.5212 3.9875 3.9712 3.9903 3.9810 4.0049 3.9447 3.8096 1.0219 1.0137 1.0049 1.0135 1.0133 0.9831 0.9951 1.0105 1.0206 1.0067 1.0042 1.0001 0.9978 1.0009 0.9975 1.0096 0.9806 1.0019 0.9999 1.0055 1.0075 0.9735 1.0008
dispersion: -0.026551230 hartree
energy: -1361.313996939085 hartree
dipole: -39.68657 35.38694 -4.29963 3.44153 -6.97251 -3.53097 3.20127 -2.59556 0.60572
magnitude: 5.59656 au
magnitude: 14.22533 debye
