program: Orca
programVersion: 5.0.2
elementType: Cl O N N N C C C C C C C C C C C C C C C C C H H H H H H H H H H H H H H H H H H H H H H H
charge: 1
multiplicity: 1
keywords: wb97x-d3
keywords: def2-TZVPP
keywords: def2/J RIJCOSX
keywords: DEFGRID2
keywords: scfconv7
keywords: smallprint printgap noloewdin
keywords: NOSOSCF
formula: C17H23ClN3O
InChI: InChI=1/C17H23ClN3O/c1-16(2)8-7-14(9-13-3-5-15(18)6-4-13)17(16,22)10-21-12-19-11-20-21/h3-6,11-12,14,19,22H,7-10H2,1-2H3
45 atoms
Cl -4.817624 -3.685953 -0.858012
O  1.976544 0.981777 1.992978
N  1.354293 2.859976 0.065494
N  0.545066 3.277613 -0.922439
N  0.223602 4.449801 0.8763
C  2.106994 0.528063 0.66786
C  3.32162 -0.441451 0.445213
C  0.915404 -0.333616 0.197692
C  2.968361 -1.134641 -0.884621
C  1.437789 -1.052207 -1.046681
C  2.335614 1.802813 -0.158568
C  -0.433677 0.357108 0.001322
C  3.379393 -1.471406 1.579659
C  4.686225 0.24166 0.387789
C  -1.539705 -0.639391 -0.213839
C  1.174212 3.568429 1.157511
C  -1.978994 -0.958819 -1.495378
C  -2.138555 -1.286465 0.864504
C  -2.982017 -1.894258 -1.704545
C  -3.144539 -2.2222 0.677737
C  -0.143249 4.246043 -0.411621
C  -3.558025 -2.520066 -0.611479
H  0.767306 -1.080421 0.987502
H  3.327312 -2.16508 -0.889862
H  3.46614 -0.635175 -1.718613
H  1.178079 -0.484395 -1.944082
H  0.978817 -2.033835 -1.162312
H  2.329265 1.602864 -1.227692
H  3.301158 2.238626 0.090117
H  -0.396021 1.02304 -0.861716
H  -0.670557 0.966489 0.878466
H  4.163146 -2.199287 1.364282
H  3.629735 -1.011826 2.538157
H  2.454977 -2.036764 1.708408
H  4.877171 0.846223 1.277746
H  5.474228 -0.512172 0.337956
H  4.811862 0.877906 -0.489395
H  1.661112 0.261109 2.5502
H  1.704665 3.478196 2.089478
H  -1.536485 -0.466809 -2.353317
H  -1.822954 -1.053823 1.875015
H  -3.309627 -2.12521 -2.709495
H  -3.601856 -2.707927 1.529544
H  -0.898806 4.817021 -0.924273
H  -0.140621 5.149778 1.512722
elementType: Cl O N C H
totalener: -1361.30279440 hartree
nucrepener: 1995.83545095 hartree
electener: -3357.13824535 hartree
oneelecener: -5803.13238873 hartree
twoeener: 2445.99414338 hartree
cpcmener: -0.10397517 hartree
kineticenergy: 1356.44460503 hartree
xcener: -110.341888737071 hartree
chargesum: 1.0000000
charge: -0.100353 -0.430423 0.134691 -0.300401 -0.099720 0.436192 0.219032 -0.077425 -0.253130 -0.206837 -0.222649 -0.096917 -0.371808 -0.358710 0.017034 0.198792 -0.221671 -0.224991 -0.152983 -0.161910 0.155379 0.097874 0.100446 0.084058 0.090523 0.089663 0.088719 0.149731 0.166355 0.098131 0.107061 0.099191 0.095408 0.112181 0.102116 0.107979 0.089707 0.229686 0.207361 0.137402 0.140447 0.141698 0.141061 0.200416 0.241594
qa: -0.1004 -0.4304 0.1347 -0.3004 -0.0997 0.4362 0.2190 -0.0774 -0.2531 -0.2068 -0.2226 -0.0969 -0.3718 -0.3587 0.0170 0.1988 -0.2217 -0.2250 -0.1530 -0.1619 0.1554 0.0979 0.1004 0.0841 0.0905 0.0897 0.0887 0.1497 0.1664 0.0981 0.1071 0.0992 0.0954 0.1122 0.1021 0.1080 0.0897 0.2297 0.2074 0.1374 0.1404 0.1417 0.1411 0.2004 0.2416
va: 1.2042 2.0076 3.4421 2.8831 3.5681 3.8370 3.7475 3.8900 4.0211 3.9032 3.8598 3.7553 3.9386 3.9154 3.5628 3.9070 3.9702 3.9942 4.0020 4.0026 3.9268 3.8295 1.0119 1.0099 1.0050 1.0061 1.0080 0.9966 0.9897 1.0175 1.0165 1.0049 1.0098 0.9954 1.0076 1.0021 0.9982 1.0116 0.9894 1.0066 1.0052 1.0064 1.0068 0.9774 0.9691
dispersion: -0.025636982 hartree
energy: -1361.328431381388 hartree
dipole: 36.32311 -33.80113 2.52198 7.75430 -0.98675 6.76756 5.38606 -3.38722 1.99884
magnitude: 7.49370 au
magnitude: 19.04748 debye
