program: Orca
programVersion: 5.0.2
elementType: Cl O N N N C C C C C C C C C C C C C C C C C H H H H H H H H H H H H H H H H H H H H H H H
charge: 1
multiplicity: 1
keywords: wb97x-d3
keywords: def2-TZVPP
keywords: def2/J RIJCOSX
keywords: DEFGRID2
keywords: scfconv7
keywords: smallprint printgap noloewdin
keywords: NOSOSCF
formula: C17H23ClN3O
InChI: InChI=1/C17H23ClN3O/c1-16(2)8-7-14(9-13-3-5-15(18)6-4-13)17(16,22)10-21-12-19-11-20-21/h3-6,11-12,14,19,22H,7-10H2,1-2H3
45 atoms
Cl 5.020569 -0.055793 0.419314
O  -2.075041 -0.158502 -1.895296
N  -0.181761 1.398764 -0.695452
N  0.433618 2.568669 -0.432934
N  1.694816 1.297736 -1.662927
C  -2.192012 -0.116056 -0.482648
C  -3.699374 -0.0396 -0.071601
C  -1.676555 -1.462103 0.141756
C  -4.114213 -1.511317 -0.166701
C  -2.955963 -2.270947 0.463119
C  -1.4797 1.16485 -0.067405
C  -0.770157 -1.415473 1.384056
C  -4.535202 0.847585 -0.98619
C  -3.867292 0.453027 1.369911
C  0.675862 -1.071742 1.15404
C  0.577141 0.618849 -1.430351
C  1.47779 -1.883906 0.351887
C  1.26214 0.041681 1.748175
C  2.811704 -1.584904 0.125333
C  2.596746 0.359587 1.534023
C  1.578898 2.486883 -1.028386
C  3.35982 -0.456425 0.716403
H  -1.116961 -1.977002 -0.644746
H  -4.252738 -1.802788 -1.212774
H  -5.0662 -1.698134 0.33356
H  -3.094121 -2.328583 1.545196
H  -2.878902 -3.297843 0.105405
H  -1.316976 1.194448 1.00805
H  -2.088497 2.031384 -0.326887
H  -0.804587 -2.418268 1.819926
H  -1.190582 -0.751858 2.142954
H  -4.572425 0.476354 -2.010134
H  -5.563063 0.885141 -0.619961
H  -4.169792 1.876835 -1.013356
H  -4.907422 0.329874 1.676179
H  -3.254125 -0.088301 2.090463
H  -3.630288 1.513852 1.468186
H  -2.471812 -0.973814 -2.22505
H  0.3578 -0.3636 -1.808037
H  1.055652 -2.765616 -0.115767
H  0.667645 0.684337 2.386831
H  3.413453 -2.224682 -0.506226
H  3.027657 1.236126 1.998649
H  2.338922 3.250069 -1.035947
H  2.496118 0.95213 -2.178642
elementType: Cl O N C H
totalener: -1361.29348575 hartree
nucrepener: 2110.32803102 hartree
electener: -3471.62151677 hartree
oneelecener: -6029.50293119 hartree
twoeener: 2557.88141442 hartree
cpcmener: -0.11038061 hartree
kineticenergy: 1356.44262502 hartree
xcener: -110.345890452256 hartree
chargesum: 1.0000000
charge: -0.101612 -0.459389 0.183136 -0.302643 -0.082904 0.466512 0.229704 -0.106850 -0.242012 -0.149540 -0.280052 -0.135167 -0.341389 -0.390091 0.042143 0.121480 -0.259626 -0.198568 -0.103005 -0.148033 0.143741 0.069453 0.097980 0.083903 0.082436 0.085988 0.082698 0.158819 0.155220 0.109187 0.119508 0.087598 0.103362 0.096658 0.103124 0.111625 0.102541 0.231308 0.219212 0.140460 0.147256 0.140479 0.143417 0.196870 0.245063
qa: -0.1016 -0.4594 0.1831 -0.3026 -0.0829 0.4665 0.2297 -0.1068 -0.2420 -0.1495 -0.2801 -0.1352 -0.3414 -0.3901 0.0421 0.1215 -0.2596 -0.1986 -0.1030 -0.1480 0.1437 0.0695 0.0980 0.0839 0.0824 0.0860 0.0827 0.1588 0.1552 0.1092 0.1195 0.0876 0.1034 0.0967 0.1031 0.1116 0.1025 0.2313 0.2192 0.1405 0.1473 0.1405 0.1434 0.1969 0.2451
va: 1.2028 1.9836 3.3834 2.8848 3.5604 3.6738 3.7973 3.9541 3.9732 3.9129 3.8514 3.7899 3.9382 3.9514 3.4419 3.9685 3.9511 3.8986 3.9295 3.8975 3.9552 3.7833 1.0170 1.0130 1.0177 1.0013 1.0145 0.9839 1.0076 1.0016 1.0062 1.0169 1.0003 1.0039 1.0057 1.0001 0.9974 1.0120 0.9865 1.0056 1.0044 1.0069 1.0071 0.9816 0.9668
dispersion: -0.030192264 hartree
energy: -1361.323678013141 hartree
dipole: -41.69450 41.67235 -0.02216 -5.31538 5.60254 0.28716 1.74863 -3.80671 -2.05808
magnitude: 2.07814 au
magnitude: 5.28221 debye
