program: Orca
programVersion: 5.0.2
elementType: Cl O N N N C C C C C C C C C C C C C C C C C H H H H H H H H H H H H H H H H H H H H H H H
charge: 1
multiplicity: 1
keywords: wb97x-d3
keywords: def2-TZVPP
keywords: def2/J RIJCOSX
keywords: DEFGRID2
keywords: scfconv7
keywords: smallprint printgap noloewdin
keywords: NOSOSCF
formula: C17H23ClN3O
InChI: InChI=1/C17H23ClN3O/c1-16(2)8-7-14(9-13-3-5-15(18)6-4-13)17(16,22)10-21-12-19-11-20-21/h3-6,11-12,14,19,22H,7-10H2,1-2H3
45 atoms
Cl 5.157226 -2.989675 0.62617
O  -2.295477 1.024751 -1.922804
N  -1.267048 2.875403 -0.227722
N  -0.067548 3.004481 0.366996
N  -0.228446 4.342246 -1.339772
C  -2.145427 0.589589 -0.581377
C  -3.2683 -0.43505 -0.168203
C  -0.820515 -0.199541 -0.462926
C  -2.594621 -1.821388 -0.357807
C  -1.236913 -1.567815 -1.010981
C  -2.238126 1.887513 0.220425
C  -0.234895 -0.328816 0.953758
C  -4.505645 -0.304779 -1.055361
C  -3.725911 -0.268743 1.284298
C  1.114289 -0.988821 0.915656
C  -1.373198 3.67611 -1.26265
C  2.229831 -0.288063 0.460214
C  1.282374 -2.318379 1.289945
C  3.474077 -0.891592 0.370316
C  2.519877 -2.942217 1.207205
C  0.553975 3.904969 -0.323973
C  3.606611 -2.220932 0.742889
H  -0.062322 0.276363 -1.092561
H  -3.21691 -2.493497 -0.950789
H  -2.454226 -2.306595 0.611004
H  -0.510872 -2.350551 -0.788936
H  -1.321836 -1.544502 -2.101023
H  -2.073595 1.744126 1.283443
H  -3.224815 2.334584 0.095806
H  -0.897739 -0.904979 1.600903
H  -0.129485 0.655839 1.40948
H  -4.307088 -0.551341 -2.098623
H  -5.272729 -0.997831 -0.705237
H  -4.935076 0.698552 -1.018799
H  -4.400672 -1.0862 1.543844
H  -2.903058 -0.294845 1.998917
H  -4.27699 0.660652 1.441064
H  -2.168702 0.285066 -2.526729
H  -2.225135 3.796709 -1.910158
H  2.128902 0.750792 0.167574
H  0.432599 -2.883863 1.653024
H  4.327557 -0.331247 0.012964
H  2.628819 -3.977579 1.500755
H  1.54749 4.270268 -0.126112
H  0.000677 5.051241 -2.027722
elementType: Cl O N C H
totalener: -1361.29554396 hartree
nucrepener: 2007.75835497 hartree
electener: -3369.05389893 hartree
oneelecener: -5827.11324077 hartree
twoeener: 2458.05934184 hartree
cpcmener: -0.11851224 hartree
kineticenergy: 1356.44775631 hartree
xcener: -110.341510086339 hartree
chargesum: 1.0000000
charge: -0.106652 -0.452866 0.155042 -0.319724 -0.098688 0.453145 0.056242 0.029342 -0.143771 -0.251888 -0.205153 -0.144599 -0.343827 -0.379472 0.044395 0.188890 -0.246776 -0.249430 -0.161416 -0.138939 0.160789 0.093966 0.096213 0.077077 0.085566 0.092559 0.087622 0.154367 0.157234 0.114203 0.111300 0.095116 0.101911 0.096112 0.107241 0.110194 0.100365 0.229723 0.214380 0.147940 0.148157 0.142667 0.144000 0.200450 0.246993
qa: -0.1067 -0.4529 0.1550 -0.3197 -0.0987 0.4531 0.0562 0.0293 -0.1438 -0.2519 -0.2052 -0.1446 -0.3438 -0.3795 0.0444 0.1889 -0.2468 -0.2494 -0.1614 -0.1389 0.1608 0.0940 0.0962 0.0771 0.0856 0.0926 0.0876 0.1544 0.1572 0.1142 0.1113 0.0951 0.1019 0.0961 0.1072 0.1102 0.1004 0.2297 0.2144 0.1479 0.1482 0.1427 0.1440 0.2005 0.2470
va: 1.1977 2.0003 3.4169 2.8812 3.5662 3.7517 3.8998 3.9269 3.8541 4.0354 3.8243 3.7297 3.9677 3.9443 3.5040 3.9259 4.0018 3.9707 4.0175 3.9784 3.9245 3.8102 1.0206 1.0143 1.0042 1.0135 1.0131 0.9915 0.9977 1.0119 1.0285 1.0042 1.0000 1.0066 1.0011 0.9982 0.9981 1.0183 0.9805 1.0026 1.0023 1.0070 1.0052 0.9770 0.9654
dispersion: -0.026116364 hartree
energy: -1361.321660327843 hartree
dipole: -38.35960 35.38949 -2.97011 4.82789 1.90220 6.73009 -2.73121 0.43992 -2.29130
magnitude: 7.70491 au
magnitude: 19.58432 debye
