program: Orca
programVersion: 5.0.2
elementType: Cl O N N N C C C C C C C C C C C C C C C C C H H H H H H H H H H H H H H H H H H H H H H H
charge: 1
multiplicity: 1
keywords: wb97x-d3
keywords: def2-TZVPP
keywords: def2/J RIJCOSX
keywords: DEFGRID2
keywords: scfconv7
keywords: smallprint printgap noloewdin
keywords: NOSOSCF
formula: C17H23ClN3O
InChI: InChI=1/C17H23ClN3O/c1-16(2)8-7-14(9-13-3-5-15(18)6-4-13)17(16,22)10-21-12-19-11-20-21/h3-6,11-12,14,19,22H,7-10H2,1-2H3
45 atoms
Cl 4.865287 0.3008 1.185373
O  -2.483324 0.066675 -1.995084
N  -0.11697 1.305322 -0.898026
N  0.860019 2.016823 -0.306152
N  1.51006 1.298709 -2.249523
C  -2.222506 -0.044275 -0.604354
C  -3.570349 -0.108909 0.226026
C  -1.588731 -1.445064 -0.448145
C  -3.83211 -1.627597 0.392925
C  -2.829047 -2.341485 -0.50638
C  -1.376415 1.14751 -0.171794
C  -0.812843 -1.694864 0.853175
C  -4.725559 0.556826 -0.525682
C  -3.485737 0.564731 1.599639
C  0.596084 -1.166975 0.915675
C  0.267203 0.864668 -2.074843
C  1.52411 -1.465592 -0.081057
C  1.028058 -0.415046 2.004603
C  2.833905 -1.01935 -0.004473
C  2.338356 0.031911 2.106311
C  1.848854 1.993728 -1.139274
C  3.23084 -0.271251 1.093684
H  -0.92401 -1.652176 -1.291537
H  -4.864926 -1.886965 0.154317
H  -3.671603 -1.921983 1.432979
H  -2.61605 -3.360072 -0.178727
H  -3.201813 -2.408461 -1.529606
H  -1.098527 1.088147 0.876708
H  -1.942686 2.072071 -0.307321
H  -0.761851 -2.780149 0.982478
H  -1.365032 -1.32757 1.718952
H  -4.981199 0.044865 -1.454211
H  -5.618717 0.538116 0.100062
H  -4.522748 1.60725 -0.753651
H  -2.673938 0.182658 2.218773
H  -3.372797 1.64789 1.526058
H  -4.41382 0.378212 2.14259
H  -3.034714 0.841102 -2.159625
H  -0.295556 0.279959 -2.780154
H  1.229763 -2.059994 -0.937742
H  0.328576 -0.168776 2.794635
H  3.536931 -1.260238 -0.790617
H  2.649351 0.615836 2.962093
H  2.804297 2.466976 -0.988788
H  2.095102 1.11396 -3.056205
elementType: Cl O N C H
totalener: -1361.29288532 hartree
nucrepener: 2113.89538466 hartree
electener: -3475.18826998 hartree
oneelecener: -6037.40616542 hartree
twoeener: 2562.21789544 hartree
cpcmener: -0.11397113 hartree
kineticenergy: 1356.45208587 hartree
xcener: -110.347191148421 hartree
chargesum: 1.0000000
charge: -0.108316 -0.450640 0.158625 -0.296955 -0.084542 0.388045 0.112066 0.082610 -0.172612 -0.219046 -0.234001 -0.191099 -0.365354 -0.373313 0.060482 0.167220 -0.261776 -0.187440 -0.172330 -0.171540 0.132633 0.128848 0.091944 0.078632 0.086214 0.080892 0.086915 0.148638 0.159438 0.109141 0.128988 0.104874 0.101917 0.103767 0.103873 0.103622 0.108281 0.233723 0.210136 0.146992 0.145874 0.143147 0.141687 0.195037 0.244703
qa: -0.1083 -0.4506 0.1586 -0.2970 -0.0845 0.3880 0.1121 0.0826 -0.1726 -0.2190 -0.2340 -0.1911 -0.3654 -0.3733 0.0605 0.1672 -0.2618 -0.1874 -0.1723 -0.1715 0.1326 0.1288 0.0919 0.0786 0.0862 0.0809 0.0869 0.1486 0.1594 0.1091 0.1290 0.1049 0.1019 0.1038 0.1039 0.1036 0.1083 0.2337 0.2101 0.1470 0.1459 0.1431 0.1417 0.1950 0.2447
va: 1.1953 1.9805 3.4190 2.8875 3.5533 3.8250 3.8587 3.7722 3.8995 3.9969 3.9012 3.8418 3.9494 3.9368 3.4951 3.9269 3.9083 3.9312 3.9421 4.0176 3.9559 3.7396 1.0128 1.0117 1.0030 1.0174 1.0237 0.9870 0.9993 1.0025 0.9917 1.0054 1.0004 1.0019 1.0016 0.9977 1.0013 1.0038 0.9944 1.0062 0.9999 1.0074 1.0072 0.9826 0.9677
dispersion: -0.030280887 hartree
energy: -1361.323166203651 hartree
dipole: -40.86660 40.35550 -0.51110 -5.52267 7.29721 1.77454 -1.38484 -2.04348 -3.42832
magnitude: 3.89405 au
magnitude: 9.89788 debye
