program: Orca
programVersion: 5.0.2
elementType: N C C C C C C C C C C C C C C C C C C C C C H H H H H H H H H H H H H H H H H H H H H H
charge: 1
multiplicity: 1
keywords: wb97x-d3
keywords: def2-TZVPP
keywords: def2/J RIJCOSX
keywords: DEFGRID2
keywords: scfconv7
keywords: smallprint printgap noloewdin
keywords: NOSOSCF
formula: C21H22N
InChI: InChI=1/C21H22N/c1-22(16-8-11-18-9-3-2-4-10-18)17-20-14-7-13-19-12-5-6-15-21(19)20/h2-15,22H,16-17H2,1H3
44 atoms
N  0.819946 -0.169379 -0.409464
C  2.160573 0.306411 0.072297
C  2.125324 1.753855 0.467554
C  2.004013 2.180602 1.822293
C  1.917862 3.575804 2.088526
C  0.922508 -1.551742 -0.996555
C  2.184642 2.688528 -0.536758
C  -0.222539 -0.098842 0.640467
C  1.957853 1.289308 2.922451
C  1.966918 4.499492 1.020104
C  2.103191 4.066083 -0.267927
C  1.77744 4.025012 3.422607
C  -0.310137 -1.9108 -1.749526
C  1.826174 1.754969 4.202452
C  1.729967 3.136543 4.459442
C  -1.139434 -2.874926 -1.34851
C  -2.371212 -3.306701 -2.011599
C  -3.149717 -4.286104 -1.391496
C  -2.813998 -2.776952 -3.227983
C  -4.337883 -4.721287 -1.960039
C  -3.999386 -3.211629 -3.7958
C  -4.767559 -4.184537 -3.164863
H  2.848392 0.164093 -0.759386
H  2.464525 -0.366479 0.870806
H  1.119097 -2.234573 -0.170868
H  1.790221 -1.538988 -1.656355
H  2.292315 2.357827 -1.563673
H  0.065434 -0.745197 1.465419
H  -1.168882 -0.430062 0.224775
H  -0.327241 0.926001 0.981008
H  2.027779 0.221995 2.763362
H  1.897815 5.55755 1.241225
H  2.149067 4.773534 -1.084777
H  1.708104 5.09022 3.606636
H  -0.496232 -1.341791 -2.655028
H  1.794501 1.054169 5.02625
H  1.621122 3.48861 5.476629
H  -0.902122 -3.403802 -0.42903
H  -2.819712 -4.707932 -0.449679
H  -2.23268 -2.021032 -3.740427
H  -4.927047 -5.479323 -1.460839
H  -4.326847 -2.790608 -4.737431
H  -5.693416 -4.520539 -3.612914
H  0.534113 0.458461 -1.167385
elementType: N C H
totalener: -868.14044668 hartree
nucrepener: 1583.89409817 hartree
electener: -2452.03454486 hartree
oneelecener: -4296.77066612 hartree
twoeener: 1844.73612126 hartree
cpcmener: -0.11243980 hartree
kineticenergy: 863.98223749 hartree
xcener: -88.295096089375 hartree
chargesum: 1.0000000
charge: 0.225738 -0.091300 0.055708 -0.116330 -0.009280 -0.038624 -0.162380 -0.229020 -0.196516 -0.134116 -0.143909 -0.096713 -0.213040 -0.153546 -0.147445 -0.036120 0.043199 -0.166254 -0.211137 -0.169194 -0.160391 -0.149962 0.151059 0.152694 0.136502 0.137242 0.146527 0.144756 0.149670 0.146413 0.149247 0.146487 0.161861 0.145065 0.135990 0.159939 0.162179 0.125797 0.144509 0.145370 0.160619 0.160594 0.162727 0.175387
qa: 0.2257 -0.0913 0.0557 -0.1163 -0.0093 -0.0386 -0.1624 -0.2290 -0.1965 -0.1341 -0.1439 -0.0967 -0.2130 -0.1535 -0.1474 -0.0361 0.0432 -0.1663 -0.2111 -0.1692 -0.1604 -0.1500 0.1511 0.1527 0.1365 0.1372 0.1465 0.1448 0.1497 0.1464 0.1492 0.1465 0.1619 0.1451 0.1360 0.1599 0.1622 0.1258 0.1445 0.1454 0.1606 0.1606 0.1627 0.1754
va: 3.6392 3.8132 3.5213 3.7987 3.8478 3.8802 3.9478 3.8751 3.9152 3.9288 3.8939 3.8758 3.9091 3.9258 3.9024 3.8324 3.6737 3.9315 3.9571 3.9022 3.9011 3.8860 0.9967 0.9968 1.0031 0.9963 1.0012 0.9923 0.9962 0.9891 1.0025 1.0037 0.9893 1.0048 1.0129 0.9916 0.9884 1.0153 1.0072 1.0103 0.9911 0.9914 0.9886 0.9924
dispersion: -0.018887661 hartree
energy: -868.159334344028 hartree
dipole: -0.94702 2.25909 1.31207 -4.88729 4.58037 -0.30692 -1.75157 1.09911 -0.65246
magnitude: 1.49714 au
magnitude: 3.80543 debye
