program: Orca
programVersion: 5.0.2
elementType: N C C C C C C C C C C C C C C C C C C C C C H H H H H H H H H H H H H H H H H H H H H H
charge: 1
multiplicity: 1
keywords: wb97x-d3
keywords: def2-TZVPP
keywords: def2/J RIJCOSX
keywords: DEFGRID2
keywords: scfconv7
keywords: smallprint printgap noloewdin
keywords: NOSOSCF
formula: C21H22N
InChI: InChI=1/C21H22N/c1-22(16-8-11-18-9-3-2-4-10-18)17-20-14-7-13-19-12-5-6-15-21(19)20/h2-15,22H,16-17H2,1H3
44 atoms
N  1.458861 -1.104243 0.729893
C  1.552872 0.079203 -0.193154
C  1.04213 1.336951 0.440452
C  1.805201 2.02171 1.432591
C  1.248309 3.177739 2.043382
C  0.046553 -1.549191 0.994749
C  -0.181447 1.82941 0.064883
C  2.328463 -2.21271 0.261375
C  3.097651 1.608416 1.839134
C  -0.022692 3.642089 1.631926
C  -0.717479 2.990389 0.654035
C  1.976409 3.853517 3.04967
C  -0.607309 -2.184897 -0.182255
C  3.781693 2.287959 2.810869
C  3.213982 3.416465 3.432028
C  -1.656377 -1.631679 -0.793566
C  -2.426052 -2.209516 -1.897906
C  -2.339273 -3.555996 -2.263875
C  -3.294395 -1.380792 -2.611453
C  -3.091495 -4.049584 -3.316774
C  -4.043401 -1.873937 -3.669619
C  -3.944778 -3.211324 -4.025729
H  0.984034 -0.173493 -1.086785
H  2.599425 0.161381 -0.485024
H  -0.504505 -0.676543 1.340902
H  0.119193 -2.251988 1.825474
H  -0.751746 1.314342 -0.697902
H  2.06555 -2.479193 -0.758204
H  2.196659 -3.067121 0.919514
H  3.360997 -1.877609 0.297704
H  3.574846 0.754881 1.374487
H  -0.432279 4.527646 2.102231
H  -1.684463 3.353189 0.332952
H  1.535416 4.728003 3.512024
H  -0.230003 -3.153969 -0.490241
H  4.769781 1.956907 3.10178
H  3.76377 3.938275 4.203775
H  -1.99332 -0.654791 -0.458461
H  -1.694592 -4.231319 -1.715815
H  -3.378968 -0.336808 -2.33418
H  -3.019274 -5.0965 -3.580989
H  -4.707584 -1.213949 -4.21208
H  -4.533668 -3.602261 -4.845037
H  1.827171 -0.82136 1.642292
elementType: N C H
totalener: -868.14067922 hartree
nucrepener: 1628.91935861 hartree
electener: -2497.06003783 hartree
oneelecener: -4386.64147794 hartree
twoeener: 1889.58144011 hartree
cpcmener: -0.11079429 hartree
kineticenergy: 863.97170955 hartree
xcener: -88.294120784197 hartree
chargesum: 1.0000000
charge: 0.222834 -0.141960 0.096305 -0.089621 -0.056233 -0.094838 -0.157844 -0.198591 -0.231386 -0.136228 -0.140381 -0.083087 -0.167093 -0.141504 -0.158225 -0.071097 0.054048 -0.211448 -0.173844 -0.164452 -0.172821 -0.145567 0.156487 0.165401 0.149869 0.154976 0.169995 0.134346 0.142282 0.137540 0.150402 0.146800 0.159004 0.145658 0.139724 0.159472 0.161312 0.135366 0.142942 0.144983 0.160601 0.159507 0.163071 0.183296
qa: 0.2228 -0.1420 0.0963 -0.0896 -0.0562 -0.0948 -0.1578 -0.1986 -0.2314 -0.1362 -0.1404 -0.0831 -0.1671 -0.1415 -0.1582 -0.0711 0.0540 -0.2114 -0.1738 -0.1645 -0.1728 -0.1456 0.1565 0.1654 0.1499 0.1550 0.1700 0.1343 0.1423 0.1375 0.1504 0.1468 0.1590 0.1457 0.1397 0.1595 0.1613 0.1354 0.1429 0.1450 0.1606 0.1595 0.1631 0.1833
va: 3.6032 3.8461 3.4096 3.9297 3.8897 3.8927 3.9030 3.8742 3.9415 3.9353 3.9131 3.8605 3.8457 3.9179 3.9104 3.8519 3.6246 3.9656 3.9385 3.9058 3.9089 3.8828 0.9946 0.9810 0.9917 0.9918 0.9835 0.9905 0.9917 0.9981 1.0056 1.0031 0.9915 1.0040 1.0005 0.9920 0.9891 1.0074 1.0104 1.0068 0.9915 0.9920 0.9884 0.9880
dispersion: -0.020072536 hartree
energy: -868.160751758805 hartree
dipole: 3.81226 -1.37291 2.43934 -8.65837 6.73217 -1.92620 -0.48057 1.66519 1.18462
magnitude: 3.32625 au
magnitude: 8.45466 debye
