program: Orca
programVersion: 5.0.2
elementType: Cl Cl N N N C C C C C C C C C C C C C H H H H H H H H H H H H H H H H
charge: 1
multiplicity: 1
keywords: wb97x-d3
keywords: def2-TZVPP
keywords: def2/J RIJCOSX
keywords: DEFGRID2
keywords: scfconv7
keywords: smallprint printgap noloewdin
keywords: NOSOSCF
formula: C13H16Cl2N3
InChI: InChI=1/C13H16Cl2N3/c1-2-3-10(7-18-9-16-8-17-18)12-5-4-11(14)6-13(12)15/h4-6,8-10,17H,2-3,7H2,1H3
34 atoms
Cl -0.533248 -0.513489 2.163481
Cl 4.141922 -1.506815 -0.209485
N  -2.381168 -0.776766 -0.639586
N  -1.505232 -1.771916 -0.823245
N  -3.144789 -2.569437 0.362097
C  -1.161639 1.36376 -0.22296
C  -1.083274 2.812436 -0.716503
C  -2.159546 0.594068 -1.097389
C  0.171692 0.65299 -0.193358
C  -0.184948 3.689658 0.148173
C  0.548508 -0.196816 0.847529
C  1.07273 0.7874 -1.250428
C  -0.162874 5.133265 -0.33062
C  1.768039 -0.857376 0.8577
C  2.290415 0.131041 -1.273615
C  -3.36387 -1.29734 0.084318
C  2.637175 -0.688614 -0.208416
C  -1.985548 -2.84123 -0.198671
H  -1.567919 1.393414 0.790569
H  -0.753074 2.853736 -1.759477
H  -2.095475 3.229664 -0.713814
H  -1.835031 0.551335 -2.13884
H  -3.139007 1.071713 -1.084804
H  -0.53387 3.648667 1.183822
H  0.831951 3.290627 0.156229
H  0.83083 1.443889 -2.07708
H  0.221898 5.211625 -1.348128
H  0.473484 5.745228 0.306493
H  -1.159564 5.575862 -0.318706
H  2.037165 -1.493941 1.689147
H  2.970896 0.267833 -2.102262
H  -4.227514 -0.724304 0.385869
H  -1.473641 -3.790959 -0.182266
H  -0.617472 -1.617517 -1.287207
totalener: -1589.50375490 hartree
nucrepener: 1608.11929577 hartree
electener: -3197.62305067 hartree
oneelecener: -5352.41066857 hartree
twoeener: 2154.78761790 hartree
kineticenergy: 1585.24356242 hartree
xcener: -108.735259246321 hartree
chargesum: 1.0000000
charge: -0.035743 -0.001385 0.067324 -0.039250 -0.260877 0.094879 -0.200063 -0.155610 -0.098816 -0.079366 -0.022068 -0.204243 -0.250788 -0.095866 -0.114987 0.162522 0.056330 0.179095 0.102691 0.080879 0.093879 0.157214 0.123600 0.075144 0.079918 0.144015 0.079990 0.101954 0.081133 0.138419 0.148440 0.176189 0.190086 0.225363
qa: -0.0357 -0.0014 0.0673 -0.0393 -0.2609 0.0949 -0.2001 -0.1556 -0.0988 -0.0794 -0.0221 -0.2042 -0.2508 -0.0959 -0.1150 0.1625 0.0563 0.1791 0.1027 0.0809 0.0939 0.1572 0.1236 0.0751 0.0799 0.1440 0.0800 0.1020 0.0811 0.1384 0.1484 0.1762 0.1901 0.2254
va: 1.2995 1.3044 3.3776 3.4700 3.0566 3.6827 3.9250 3.8242 3.3358 3.8691 3.9929 3.9583 3.9663 3.9711 4.0323 4.0069 4.0235 3.9651 1.0389 1.0086 1.0121 0.9911 1.0126 1.0071 1.0063 1.0082 1.0015 1.0064 1.0028 1.0152 1.0070 0.9868 0.9791 0.9894
dispersion: -0.018940969 hartree
energy: -1589.522695865024 hartree
dipole: -14.29646 11.88503 -2.41142 27.90631 -28.38318 -0.47687 -10.71612 9.05784 -1.65828
magnitude: 2.96517 au
magnitude: 7.53687 debye
