program: Orca
programVersion: 5.0.2
elementType: Cl Cl N N N C C C C C C C C C C C C C H H H H H H H H H H H H H H H H
charge: 1
multiplicity: 1
keywords: wb97x-d3
keywords: def2-TZVPP
keywords: def2/J RIJCOSX
keywords: DEFGRID2
keywords: scfconv7
keywords: smallprint printgap noloewdin
keywords: NOSOSCF
formula: C13H16Cl2N3
InChI: InChI=1/C13H16Cl2N3/c1-2-3-10(7-18-9-16-8-17-18)12-5-4-11(14)6-13(12)15/h4-6,8-10,17H,2-3,7H2,1H3
34 atoms
Cl 0.51277 0.658936 2.774694
Cl 4.129131 -1.554794 -0.470657
N  -2.499435 -0.83903 -0.165971
N  -1.661121 -1.854109 -0.40746
N  -3.415304 -2.160208 -1.65552
C  -1.168632 1.240401 0.272842
C  -1.684154 2.028156 -0.932646
C  -2.210993 0.237169 0.782451
C  0.172061 0.566399 0.079425
C  -0.78814 3.192889 -1.353869
C  0.991735 0.243989 1.16563
C  0.639005 0.202893 -1.184119
C  -0.519858 4.195444 -0.240864
C  2.20516 -0.408559 1.008629
C  1.846619 -0.447968 -1.369468
C  -3.555189 -1.05852 -0.938579
C  2.629259 -0.753048 -0.26526
C  -2.235964 -2.635241 -1.315462
H  -1.074656 1.944729 1.104217
H  -1.856828 1.371444 -1.792048
H  -2.667143 2.431296 -0.666388
H  -3.16513 0.731755 0.962444
H  -1.903061 -0.223194 1.721807
H  0.161129 2.822806 -1.746429
H  -1.277944 3.698886 -2.187856
H  0.053924 0.445823 -2.061596
H  0.011963 5.063232 -0.627076
H  0.098345 3.778612 0.55552
H  -1.447013 4.556968 0.207122
H  2.817479 -0.633664 1.870705
H  2.183989 -0.701352 -2.364825
H  -4.411864 -0.402139 -0.948371
H  -1.7723 -3.531265 -1.698548
H  -0.73712 -1.886478 0.008931
totalener: -1589.50185294 hartree
nucrepener: 1598.54667423 hartree
electener: -3188.04852717 hartree
oneelecener: -5333.17341365 hartree
twoeener: 2145.12488648 hartree
kineticenergy: 1585.23132357 hartree
xcener: -108.734696962633 hartree
chargesum: 1.0000000
charge: -0.021436 -0.002199 0.067496 -0.040633 -0.270272 0.120927 -0.248660 -0.183593 -0.086205 -0.103731 -0.029649 -0.256143 -0.259578 -0.098471 -0.106809 0.162280 0.057129 0.182240 0.124497 0.082782 0.107742 0.133413 0.178305 0.080344 0.092476 0.152221 0.109353 0.075427 0.090423 0.137938 0.148063 0.181780 0.192347 0.230195
qa: -0.0214 -0.0022 0.0675 -0.0406 -0.2703 0.1209 -0.2487 -0.1836 -0.0862 -0.1037 -0.0296 -0.2561 -0.2596 -0.0985 -0.1068 0.1623 0.0571 0.1822 0.1245 0.0828 0.1077 0.1334 0.1783 0.0803 0.0925 0.1522 0.1094 0.0754 0.0904 0.1379 0.1481 0.1818 0.1923 0.2302
va: 1.3181 1.3034 3.3592 3.4728 3.0678 3.6042 3.9214 3.8033 3.3693 3.8954 4.0899 3.8729 3.9390 3.9803 4.0316 3.9869 4.0295 3.9510 1.0103 1.0100 1.0026 1.0080 1.0089 1.0055 1.0072 1.0036 1.0091 1.0007 1.0027 1.0161 1.0072 0.9849 0.9777 0.9864
dispersion: -0.019068561 hartree
energy: -1589.520921502374 hartree
dipole: -20.29542 17.47868 -2.81674 19.47415 -20.46314 -0.98899 -9.91250 9.42943 -0.48307
magnitude: 3.02415 au
magnitude: 7.68677 debye
