program: Orca
programVersion: 5.0.2
elementType: Cl Cl N N N C C C C C C C C C C C C C H H H H H H H H H H H H H H H H
charge: 1
multiplicity: 1
keywords: wb97x-d3
keywords: def2-TZVPP
keywords: def2/J RIJCOSX
keywords: DEFGRID2
keywords: scfconv7
keywords: smallprint printgap noloewdin
keywords: NOSOSCF
formula: C13H16Cl2N3
InChI: InChI=1/C13H16Cl2N3/c1-2-3-10(7-18-9-16-8-17-18)12-5-4-11(14)6-13(12)15/h4-6,8-10,17H,2-3,7H2,1H3
34 atoms
Cl 0.218028 0.440908 -2.276145
Cl 4.068344 -2.111925 0.381527
N  -2.38449 -0.544765 0.106323
N  -1.903394 -1.488368 -0.71004
N  -2.916739 -2.506801 0.922492
C  -0.855309 1.373425 0.588135
C  -0.529751 2.808454 0.145272
C  -2.145181 0.884859 -0.089532
C  0.335909 0.449578 0.461118
C  -1.618207 3.82831 0.467647
C  0.924464 0.031369 -0.73048
C  0.963389 0.024821 1.632244
C  -1.174697 5.246609 0.139677
C  2.063929 -0.753636 -0.771715
C  2.103113 -0.758444 1.630408
C  -2.990054 -1.198099 1.089333
C  2.654692 -1.145434 0.419397
C  -2.238647 -2.665236 -0.195485
H  -1.080537 1.418696 1.658848
H  0.393079 3.100263 0.65183
H  -0.307468 2.831175 -0.924073
H  -2.161551 1.079667 -1.159955
H  -3.008596 1.393819 0.33541
H  -2.533846 3.609685 -0.0911
H  -1.880563 3.763492 1.528401
H  0.551496 0.332907 2.585421
H  -0.932385 5.352214 -0.918231
H  -0.289795 5.527087 0.711199
H  -1.957672 5.966988 0.370689
H  2.493136 -1.047974 -1.719401
H  2.561535 -1.05899 2.561923
H  -3.482134 -0.691219 1.905455
H  -1.979607 -3.604688 -0.658857
H  -1.367258 -1.240833 -1.539094
totalener: -1589.50327467 hartree
nucrepener: 1590.44345203 hartree
electener: -3179.94672670 hartree
oneelecener: -5317.07791794 hartree
twoeener: 2137.13119124 hartree
kineticenergy: 1585.23412216 hartree
xcener: -108.730785088614 hartree
chargesum: 1.0000000
charge: -0.059140 -0.005248 0.095488 -0.064356 -0.271128 0.099653 -0.151510 -0.257530 0.020205 -0.105535 -0.131293 -0.144746 -0.257477 -0.055177 -0.100901 0.152885 0.042672 0.180501 0.081276 0.101123 0.095311 0.170290 0.140705 0.059614 0.074160 0.129202 0.083100 0.086429 0.099889 0.137905 0.144559 0.180465 0.192320 0.236289
qa: -0.0591 -0.0052 0.0955 -0.0644 -0.2711 0.0997 -0.1515 -0.2575 0.0202 -0.1055 -0.1313 -0.1447 -0.2575 -0.0552 -0.1009 0.1529 0.0427 0.1805 0.0813 0.1011 0.0953 0.1703 0.1407 0.0596 0.0742 0.1292 0.0831 0.0864 0.0999 0.1379 0.1446 0.1805 0.1923 0.2363
va: 1.2910 1.3007 3.3627 3.4568 3.0695 3.6527 3.8464 3.8807 3.4172 3.8823 3.9960 3.9896 3.9803 3.9534 4.0095 3.9991 4.0468 3.9586 1.0266 1.0137 1.0155 0.9833 1.0018 1.0067 1.0010 1.0073 1.0018 1.0037 1.0058 1.0098 1.0067 0.9852 0.9777 1.0231
dispersion: -0.017877083 hartree
energy: -1589.521151756700 hartree
dipole: -20.10170 17.31008 -2.79162 27.22298 -27.50967 -0.28669 7.51039 -7.50295 0.00744
magnitude: 2.80631 au
magnitude: 7.13308 debye
