program: Orca
programVersion: 5.0.2
elementType: Cl Cl N N N C C C C C C C C C C C C C H H H H H H H H H H H H H H H H
charge: 1
multiplicity: 1
keywords: wb97x-d3
keywords: def2-TZVPP
keywords: def2/J RIJCOSX
keywords: DEFGRID2
keywords: scfconv7
keywords: smallprint printgap noloewdin
keywords: NOSOSCF
formula: C13H16Cl2N3
InChI: InChI=1/C13H16Cl2N3/c1-2-3-10(7-18-9-16-8-17-18)12-5-4-11(14)6-13(12)15/h4-6,8-10,17H,2-3,7H2,1H3
34 atoms
Cl -0.34475 -0.501905 -1.796748
Cl 4.408014 -2.082907 -0.002407
N  -2.111661 -0.219548 0.830402
N  -3.088261 -0.102447 -0.072953
N  -2.727615 -2.224508 0.212034
C  -0.348581 1.594848 0.668035
C  -0.786483 2.450321 -0.533065
C  -1.453355 0.907383 1.480047
C  0.809464 0.648233 0.412279
C  -1.562628 3.72219 -0.166384
C  0.904709 -0.298338 -0.607163
C  1.888635 0.705413 1.296815
C  -3.078252 3.576339 -0.116132
C  2.002383 -1.137727 -0.742999
C  2.997207 -0.113887 1.190864
C  -1.914592 -1.519912 0.982404
C  3.042141 -1.038618 0.162142
C  -3.444498 -1.32223 -0.433851
H  0.037077 2.314515 1.39652
H  0.132255 2.743327 -1.045975
H  -1.358977 1.882512 -1.266876
H  -2.225464 1.615166 1.77459
H  -1.030553 0.498484 2.395809
H  -1.195152 4.125327 0.782025
H  -1.327795 4.480302 -0.916676
H  1.860077 1.428526 2.102648
H  -3.55608 4.545199 0.036747
H  -3.424181 2.929449 0.692216
H  -3.464546 3.17255 -1.055298
H  2.040309 -1.857963 -1.548802
H  3.809277 -0.02627 1.899471
H  -1.176794 -1.910542 1.666183
H  -4.222117 -1.510641 -1.156695
H  -3.440878 0.802547 -0.374113
elementType: Cl N C H
totalener: -1589.59355323 hartree
nucrepener: 1611.78602461 hartree
electener: -3201.37957784 hartree
oneelecener: -5359.21596328 hartree
twoeener: 2157.83638544 hartree
cpcmener: -0.10378565 hartree
kineticenergy: 1585.19817053 hartree
xcener: -108.724247053114 hartree
chargesum: 1.0000000
charge: -0.091830 -0.077274 0.069986 -0.048695 -0.342386 0.048506 -0.128352 -0.142233 0.084812 -0.097945 -0.074089 -0.163480 -0.297096 -0.094727 -0.154200 0.162853 0.077017 0.186159 0.073470 0.110661 0.070061 0.181979 0.147931 0.063873 0.080339 0.141035 0.105301 0.073729 0.085047 0.128481 0.147362 0.197192 0.200839 0.275676
qa: -0.0918 -0.0773 0.0700 -0.0487 -0.3424 0.0485 -0.1284 -0.1422 0.0848 -0.0979 -0.0741 -0.1635 -0.2971 -0.0947 -0.1542 0.1629 0.0770 0.1862 0.0735 0.1107 0.0701 0.1820 0.1479 0.0639 0.0803 0.1410 0.1053 0.0737 0.0850 0.1285 0.1474 0.1972 0.2008 0.2757
va: 1.2311 1.2257 3.3606 3.4517 3.0322 3.7492 3.8757 3.8683 3.4213 3.8791 3.9379 3.9667 3.9273 4.0093 4.0058 3.9938 3.8984 3.9576 1.0267 1.0071 1.0250 0.9768 1.0018 1.0094 1.0011 1.0017 1.0078 0.9995 0.9998 1.0170 1.0044 0.9803 0.9754 0.9512
dispersion: -0.019424363 hartree
energy: -1589.612977589855 hartree
dipole: -23.02372 18.52505 -4.49867 27.28781 -25.45587 1.83194 7.53958 -5.94355 1.59603
magnitude: 5.11286 au
magnitude: 12.99586 debye
