program: Orca
programVersion: 5.0.2
elementType: Cl Cl N N N C C C C C C C C C C C C C H H H H H H H H H H H H H H H H
charge: 1
multiplicity: 1
keywords: wb97x-d3
keywords: def2-TZVPP
keywords: def2/J RIJCOSX
keywords: DEFGRID2
keywords: scfconv7
keywords: smallprint printgap noloewdin
keywords: NOSOSCF
formula: C13H16Cl2N3
InChI: InChI=1/C13H16Cl2N3/c1-2-3-10(7-18-9-16-8-17-18)12-5-4-11(14)6-13(12)15/h4-6,8-10,17H,2-3,7H2,1H3
34 atoms
Cl 0.132655 0.14844 -2.30566
Cl -3.95733 -1.733386 0.563939
N  2.355603 -0.715634 0.604732
N  2.836895 -1.027777 -0.602472
N  1.975217 -2.840856 0.237313
C  1.170882 1.440776 0.357467
C  1.059614 2.828129 0.998365
C  2.253789 0.650604 1.099527
C  -0.127441 0.672304 0.361404
C  0.017927 3.735298 0.354053
C  -0.660101 0.047165 -0.763154
C  -0.827156 0.509155 1.556897
C  0.269446 4.021947 -1.118754
C  -1.836268 -0.689434 -0.71865
C  -1.997025 -0.222784 1.63923
C  1.825965 -1.830306 1.081278
C  -2.494098 -0.815883 0.490137
C  2.603171 -2.311683 -0.799502
H  1.511774 1.577739 -0.670123
H  0.843258 2.725203 2.064978
H  2.042307 3.304312 0.932257
H  2.032262 0.562832 2.161797
H  3.228396 1.125925 0.993909
H  -0.97955 3.305636 0.481141
H  0.010206 4.677675 0.906738
H  -0.443077 0.966694 2.460093
H  0.162697 3.130416 -1.738533
H  1.274723 4.416282 -1.280229
H  -0.438074 4.760007 -1.49802
H  -2.224851 -1.15556 -1.613396
H  -2.509935 -0.326047 2.585122
H  1.348988 -1.869738 2.047637
H  2.909917 -2.822927 -1.697626
H  3.301792 -0.343418 -1.193719
elementType: Cl N C H
totalener: -1589.59987700 hartree
nucrepener: 1625.78352623 hartree
electener: -3215.38340324 hartree
oneelecener: -5387.31445999 hartree
twoeener: 2171.93105675 hartree
cpcmener: -0.11805828 hartree
kineticenergy: 1585.22339281 hartree
xcener: -108.730956803707 hartree
chargesum: 1.0000000
charge: -0.088118 -0.084549 0.086742 -0.048276 -0.358068 0.085620 -0.196814 -0.088638 -0.027729 -0.097066 0.014224 -0.180150 -0.278193 -0.122431 -0.141039 0.166765 0.095619 0.190719 0.108646 0.094059 0.097501 0.140874 0.152171 0.066557 0.075797 0.146449 0.073613 0.085544 0.095135 0.124947 0.148615 0.195634 0.205881 0.259959
qa: -0.0881 -0.0845 0.0867 -0.0483 -0.3581 0.0856 -0.1968 -0.0886 -0.0277 -0.0971 0.0142 -0.1802 -0.2782 -0.1224 -0.1410 0.1668 0.0956 0.1907 0.1086 0.0941 0.0975 0.1409 0.1522 0.0666 0.0758 0.1464 0.0736 0.0855 0.0951 0.1249 0.1486 0.1956 0.2059 0.2600
va: 1.2287 1.2183 3.3661 3.4865 3.0299 3.6928 3.9444 3.8125 3.4441 3.8823 3.9058 3.9520 3.9260 4.0777 4.0167 3.9875 3.8638 3.9447 1.0200 1.0082 1.0054 0.9944 0.9994 1.0075 1.0071 1.0055 1.0092 1.0027 1.0052 1.0191 1.0024 0.9823 0.9732 0.9616
dispersion: -0.019893460 hartree
energy: -1589.619770462819 hartree
dipole: 16.83998 -11.46499 5.37499 24.63663 -24.35348 0.28316 6.92807 -6.11544 0.81263
magnitude: 5.44344 au
magnitude: 13.83613 debye
