program: Orca
programVersion: 5.0.2
elementType: Cl Cl N N N C C C C C C C C C C C C C H H H H H H H H H H H H H H H H
charge: 1
multiplicity: 1
keywords: wb97x-d3
keywords: def2-TZVPP
keywords: def2/J RIJCOSX
keywords: DEFGRID2
keywords: scfconv7
keywords: smallprint printgap noloewdin
keywords: NOSOSCF
formula: C13H16Cl2N3
InChI: InChI=1/C13H16Cl2N3/c1-2-3-10(7-18-9-16-8-17-18)12-5-4-11(14)6-13(12)15/h4-6,8-10,17H,2-3,7H2,1H3
34 atoms
Cl 0.136806 -0.349341 -2.132431
Cl -4.118318 -2.045491 0.612853
N  2.23948 -0.442888 0.528177
N  3.055296 -0.599855 -0.518019
N  2.228331 -2.555439 -0.045773
C  0.74143 1.522828 0.288242
C  0.494175 2.924284 0.868468
C  1.877918 0.856559 1.074455
C  -0.485517 0.644138 0.328882
C  1.522602 3.969189 0.44058
C  -0.83351 -0.232017 -0.696905
C  -1.305703 0.639215 1.456974
C  1.435882 4.34594 -1.031365
C  -1.946788 -1.057843 -0.628751
C  -2.419297 -0.174191 1.561614
C  1.743025 -1.643048 0.783194
C  -2.731402 -1.018161 0.508408
C  3.035285 -1.878294 -0.844918
H  1.064625 1.63766 -0.748353
H  -0.497564 3.260685 0.556207
H  0.468565 2.867641 1.96003
H  1.583846 0.678095 2.107793
H  2.77723 1.469575 1.081852
H  1.359766 4.86391 1.045581
H  2.536014 3.63337 0.677222
H  -1.067231 1.291152 2.286996
H  1.645617 3.501302 -1.689295
H  2.153015 5.129912 -1.276893
H  0.441195 4.720032 -1.281465
H  -2.190154 -1.719049 -1.448654
H  -3.030591 -0.14767 2.452598
H  1.046909 -1.816659 1.588535
H  3.623571 -2.276282 -1.655698
H  3.566792 0.181022 -0.920729
elementType: Cl N C H
totalener: -1589.59929458 hartree
nucrepener: 1608.43541259 hartree
electener: -3198.03470718 hartree
oneelecener: -5352.59220866 hartree
twoeener: 2154.55750148 hartree
cpcmener: -0.11854900 hartree
kineticenergy: 1585.21806452 hartree
xcener: -108.729821428559 hartree
chargesum: 1.0000000
charge: -0.087434 -0.084989 0.074244 -0.034089 -0.352507 0.076292 -0.167191 -0.068302 -0.014266 -0.108987 0.004721 -0.177910 -0.268914 -0.111594 -0.168744 0.142899 0.098020 0.186774 0.112492 0.098393 0.091942 0.143628 0.145689 0.073774 0.058984 0.151998 0.076335 0.092631 0.081387 0.125455 0.146710 0.201066 0.204026 0.257470
qa: -0.0874 -0.0850 0.0742 -0.0341 -0.3525 0.0763 -0.1672 -0.0683 -0.0143 -0.1090 0.0047 -0.1779 -0.2689 -0.1116 -0.1687 0.1429 0.0980 0.1868 0.1125 0.0984 0.0919 0.1436 0.1457 0.0738 0.0590 0.1520 0.0763 0.0926 0.0814 0.1255 0.1467 0.2011 0.2040 0.2575
va: 1.2397 1.2176 3.3790 3.4793 3.0187 3.7500 3.9392 3.7990 3.3976 3.9200 3.9400 3.9789 3.9206 4.0531 4.0483 4.0068 3.8641 3.9481 1.0126 1.0041 1.0080 0.9957 1.0028 1.0064 1.0090 0.9975 1.0032 1.0042 1.0017 1.0199 1.0051 0.9792 0.9742 0.9626
dispersion: -0.018893619 hartree
energy: -1589.618188203895 hartree
dipole: 20.19666 -14.95842 5.23823 28.82326 -27.65174 1.17152 6.49304 -5.61272 0.88031
magnitude: 5.43935 au
magnitude: 13.82572 debye
