program: Orca
programVersion: 5.0.2
elementType: Cl Cl N N N C C C C C C C C C C C C C H H H H H H H H H H H H H H H H
charge: 1
multiplicity: 1
keywords: wb97x-d3
keywords: def2-TZVPP
keywords: def2/J RIJCOSX
keywords: DEFGRID2
keywords: scfconv7
keywords: smallprint printgap noloewdin
keywords: NOSOSCF
formula: C13H16Cl2N3
InChI: InChI=1/C13H16Cl2N3/c1-2-3-10(7-18-9-16-8-17-18)12-5-4-11(14)6-13(12)15/h4-6,8-10,17H,2-3,7H2,1H3
34 atoms
Cl 0.327363 -0.252524 -2.225307
Cl -4.041281 -1.472129 0.596207
N  2.355804 -0.774274 0.596242
N  3.096485 -1.124282 -0.460482
N  1.895908 -2.854307 0.086687
C  1.250828 1.415802 0.250748
C  1.256153 2.85537 0.779732
C  2.252149 0.595901 1.078073
C  -0.093827 0.727897 0.285251
C  0.638337 3.888187 -0.157803
C  -0.57904 -0.060161 -0.756117
C  -0.876389 0.784526 1.438111
C  -0.861865 3.771328 -0.385753
C  -1.788751 -0.736706 -0.679271
C  -2.083981 0.121571 1.551236
C  1.626608 -1.839171 0.893916
C  -2.533056 -0.634219 0.480655
C  2.806555 -2.379471 -0.746864
H  1.620533 1.451739 -0.776621
H  0.78044 2.906474 1.761781
H  2.300138 3.136379 0.941461
H  1.948996 0.530938 2.1219
H  3.247031 1.038125 1.042919
H  0.85193 4.874422 0.261455
H  1.157911 3.851893 -1.119569
H  -0.530617 1.362827 2.284864
H  -1.224742 4.623646 -0.961883
H  -1.409169 3.757271 0.558705
H  -1.132363 2.871552 -0.938118
H  -2.136177 -1.333679 -1.511023
H  -2.662083 0.194242 2.461731
H  0.926095 -1.842638 1.714255
H  3.282041 -2.91179 -1.554344
H  3.747516 -0.480159 -0.901546
elementType: Cl N C H
totalener: -1589.59783081 hartree
nucrepener: 1630.03198518 hartree
electener: -3219.62981599 hartree
oneelecener: -5396.00265680 hartree
twoeener: 2176.37284081 hartree
cpcmener: -0.11819617 hartree
kineticenergy: 1585.21909303 hartree
xcener: -108.730547776718 hartree
chargesum: 1.0000000
charge: -0.083964 -0.084646 0.081269 -0.034554 -0.352960 0.112721 -0.176576 -0.069439 -0.100052 -0.105418 0.046882 -0.164018 -0.275607 -0.114348 -0.157500 0.144008 0.101890 0.187401 0.099027 0.091847 0.089510 0.145578 0.145329 0.074204 0.057640 0.148182 0.100273 0.082166 0.082430 0.123937 0.147596 0.198349 0.203669 0.255175
qa: -0.0840 -0.0846 0.0813 -0.0346 -0.3530 0.1127 -0.1766 -0.0694 -0.1001 -0.1054 0.0469 -0.1640 -0.2756 -0.1143 -0.1575 0.1440 0.1019 0.1874 0.0990 0.0918 0.0895 0.1456 0.1453 0.0742 0.0576 0.1482 0.1003 0.0822 0.0824 0.1239 0.1476 0.1983 0.2037 0.2552
va: 1.2404 1.2182 3.3656 3.4852 3.0183 3.7359 3.9545 3.8040 3.4539 3.8857 3.8614 3.9280 3.9429 4.0677 4.0362 4.0093 3.8583 3.9471 1.0299 1.0058 1.0077 0.9942 1.0024 1.0051 1.0094 1.0037 1.0051 1.0032 0.9932 1.0204 1.0032 0.9806 0.9743 0.9645
dispersion: -0.020186981 hartree
energy: -1589.618017791888 hartree
dipole: 15.37440 -9.63081 5.74359 24.88918 -24.60568 0.28350 7.27475 -6.36422 0.91053
magnitude: 5.82222 au
magnitude: 14.79890 debye
