program: Gaussian 09
title: 000070908
version: EM64L-G09RevD.01
frameworkgroup: C1[X(C6H16N2O)]
method: RPBEPBE
basis: SDD
operation: Freq
keyword: #p
keyword: freq=noraman
keyword: PBEPBE/SDD
title: #p freq=noraman PBEPBE/SDD
converged: YES YES NO NO
title: Mulliken charges:
elementType: O N N C C C C C C H H H H H H H H H H H H H H H H
charge: -0.294642 -0.104803 -0.094110 -0.007063 -0.604652 -0.642010 -0.623369 -0.601779 -0.506834 0.203729 0.216892 0.211972 0.214271 0.218732 0.257622 0.192069 0.211664 0.232022 0.222016 0.211043 0.215330 0.221360 0.224447 0.230206 0.195889
chargesum: 0.00000
title: Mulliken charges with hydrogens summed into heavy atoms:
elementType: O N N C C C C C C
charge: -0.294642 -0.104803 -0.094110 0.196665 0.038483 0.026413 0.042334 0.045953 0.143707
polarizability: 9.09074415e+01 -6.49724893e-01 8.58779472e+01 -1.51017853e+00 -1.05973693e+00 7.64275733e+01
1716.lowfreq: -23.3823 -9.1690 -0.0009 -0.0008 -0.0005 12.4803 49.1910 84.2100 98.5654
frequency: 48.2131 84.1596 98.5580 138.0801 149.4236 153.8984 187.4776 202.9167 213.5513 248.6007 278.3756 294.1290 305.9347 345.0828 390.9700 479.8584 514.3053 575.1324 824.2708 857.0932 881.5542 984.8393 1017.1183 1035.4878 1047.9639 1057.7683 1083.1608 1094.8244 1114.2052 1135.7098 1138.1914 1144.3546 1194.1003 1228.3315 1271.5953 1306.9923 1308.5831 1378.6722 1410.7033 1415.5477 1422.3981 1437.9274 1442.5729 1449.8890 1456.8870 1461.0581 1464.8085 1472.9726 1479.9701 1483.6902 1486.5752 1495.8456 1506.7906 2887.8896 2899.3241 2906.6349 2922.0250 2929.5653 2937.5611 2983.7436 3002.1016 3019.5324 3025.8503 3033.2538 3058.5769 3066.4886 3091.2342 3095.5409 3106.7772
redmass: 2.5361 2.5517 1.7645 1.3309 1.9725 1.5416 1.1844 1.4122 1.1561 1.3202 2.5443 3.5508 2.5884 2.4286 2.3842 4.0760 3.5932 3.9934 4.9085 3.7584 4.2507 8.1289 2.4272 1.6271 1.6297 1.5311 1.2609 1.2443 1.2643 1.3830 1.4248 1.4548 3.0571 2.6289 2.4302 2.6478 1.6984 1.2717 1.1373 1.1331 1.1333 1.1418 1.1647 1.0552 1.0513 1.0636 1.0527 1.0554 1.0526 1.0542 1.0562 1.0573 1.0691 1.0516 1.0738 1.0588 1.0453 1.0477 1.0362 1.0836 1.0825 1.0879 1.0970 1.0866 1.0997 1.1003 1.0942 1.1006 1.0955
irintensity: 0.0809 2.3228 2.4006 1.7494 9.0888 2.6879 3.6798 1.6672 2.7164 2.3286 3.7361 11.1628 4.7589 2.5607 9.3479 2.0020 10.9444 2.8211 101.0618 4.0548 39.2167 176.2952 16.5076 109.5421 62.2332 62.4549 4.1806 5.5636 0.6265 0.9025 2.0176 5.8506 15.0779 28.2008 46.1590 55.3839 20.8970 7.3328 3.2184 10.6814 6.0698 5.6794 16.2714 6.8372 22.6688 0.2987 19.7998 7.4382 12.7323 14.2143 15.3263 13.8560 19.4156 104.2527 77.4930 107.6897 74.3299 104.4583 80.8327 75.9563 50.8294 52.9095 53.7508 42.9664 38.8032 42.7273 17.3538 29.7087 27.1451
temp: 298.150 k
press: 1.00000 atm
elementType: 8 7 7 6 6 6 6 6 6 1 1 1 1 1 1 1 1 1 1 1 1 1 1 1 1
symmnumber: 1
zpe: 578198.4 jmol-1
zpe.correction: 0.220224 hartree
zpe.thermalcorrener: 0.232770 hartree
zpe.thermalcorrenthalpy: 0.233714 hartree
zpe.thermalcorrgfe: 0.182261 hartree
zpe.sumelectzpe: -422.127525 hartree
zpe.sumelectthermal: -422.114979 hartree
zpe.sumelectthermalent: -422.114035 hartree
zpe.sumelectthermalfe: -422.165488 hartree
dipole: -0.4754 -0.0649 -0.4646
dipole: 0.6679
quadrupole: -55.1423 -56.2738 -56.3737
quadrupole: -0.7840 -0.5143 -2.3933
quadrupole: 0.7876 -0.3439 -0.4438 -0.7840 -0.5143 -2.3933
hfenergy: -422.3477489 hartree
pointgroup: C01 [X(C6H16N2O1)]
dipole: 0.1827096 -0.0556691 0.1804665 debye
dipolederiv: -0.7537193 -0.2049738 -0.0309215 -0.3721841 -1.0989999 -0.031881 0.1041197 0.1487197 -0.3882295 -0.7935628 0.1342019 0.0256059 0.0599968 -0.8059619 0.0202216 0.1454235 -0.0064269 -0.5598955 -0.9499686 -0.0079741 -0.0584414 -0.1335593 -0.715338 -0.0050432 -0.0880837 0.0491163 -0.5113868 1.5850577 -0.0886609 0.0695254 0.2871371 1.3800042 0.0179147 -0.0949763 -0.1920093 0.4110318 0.2430361 0.0547943 0.0992868 0.0088355 0.4841793 -0.134008 0.1362621 -0.1938014 0.2510495 0.2953688 0.0663761 -0.1357669 0.1097834 0.1638019 0.173553 -0.173925 0.25011 0.4026403 0.0948242 0.0540708 0.1000785 0.0597347 0.2914911 0.0024884 0.1343378 -0.0112326 0.4165601 0.3514358 -0.0812032 -0.0852279 -0.1491253 0.3067277 -0.0443912 -0.1577788 -0.0481264 0.1874657 0.3920881 0.2315166 0.0096148 0.0740968 0.4603928 0.072132 0.072072 0.185293 0.2999323 -0.0278702 0.0271563 0.0108346 -0.0547019 -0.0366283 -0.0741188 0.0503897 -0.0355614 -0.2347193 0.0960611 -0.0108879 0.1037443 0.0107198 0.0521904 -0.0944633 0.0489035 -0.023156 -0.1480287 -0.1915278 0.1249809 -0.0512317 0.0681183 0.0053275 0.0442912 0.015364 0.0081809 0.1037439 -0.0038851 -0.1671285 -0.0238872 -0.0799974 -0.2196757 0.0451488 -0.0623856 -0.065574 0.0142789 -0.2571162 0.0383631 0.0578584 0.0232715 0.0837939 -0.0498751 -0.0253426 -0.0194283 0.0494486 0.1275042 0.0125842 -0.0588185 0.0045103 0.0092572 0.1249349 -0.0216825 0.0896821 0.0189746 0.0210589 -0.1154213 -0.0419506 -0.0559375 -0.1511822 -0.2172887 0.0297587 -0.1103042 -0.0886844 -0.1440139 -0.1494611 -0.063433 -0.1184533 0.0301688 -0.0126746 0.0043823 0.0095871 0.0590897 0.0148876 0.1423454 0.0895289 0.1264839 -0.007054 -0.045641 0.0466051 -0.0397761 0.023598 0.0779687 -0.004983 -0.0330807 0.0464437 -0.063696 0.1795564 -0.0599062 0.0437528 -0.1491928 0.0976716 -0.0081705 -0.0957758 0.0320218 0.060169 -0.0685832 -0.0088706 -0.0723061 -0.1591628 -0.1656719 -0.0799828 0.0282926 -0.1423491 -0.0156144 0.0034081 -0.0223992 -0.0109347 0.1081006 -0.0181441 0.0706927 0.0303138 0.1754207 -0.1472397 0.0600088 -0.0525474 0.1371689 0.0016526 0.0714276 -0.0128 -0.0157928 -0.0550446 -0.1358548 0.095304 -0.0072587 0.1270597 0.0254131 -0.1873089 0.0062804 0.0084096 0.1025407 0.049 -0.0224823 -0.0019502 -0.0498691 0.0659022 0.0243981 -0.0317157 0.0612344 -0.0277624 0.0207413 -0.0385115 -0.0105117 -0.170164 -0.1995821 unknown
polarizability: 90.9840686|0.0539935|85.6905055|-1.3947505|1.5851755|76.5383879 unknown
InChI: InChI=1S/C6H16N2O/c1-7(2)6(9-5)8(3)4/h6H,1-5H3
charge 0 multiplicity 1
25 atoms
O  0.089201 1.453499 -0.408829
N  1.128935 -0.645789 0.155399
N  -1.353448 -0.402702 0.067212
C  -0.051958 0.18732 0.368757
C  1.270031 -1.788766 1.062416
C  1.690616 -0.825269 -1.189868
C  -1.590432 -0.852281 -1.319422
C  -2.491586 0.35473 0.629727
C  1.15363 2.322816 0.100061
H  -0.075203 0.445153 1.454292
H  0.981365 -1.492092 2.087989
H  2.326451 -2.119306 1.084656
H  0.638613 -2.661999 0.777041
H  2.796399 -0.883083 -1.130898
H  1.41782 0.043309 -1.811602
H  1.339611 -1.749856 -1.70582
H  -2.544456 -1.410088 -1.353548
H  -0.790959 -1.538179 -1.638489
H  -1.64997 -0.013135 -2.04811
H  -2.279292 0.612983 1.683675
H  -3.398704 -0.277287 0.609437
H  -2.703572 1.298572 0.07976
H  1.129859 3.23221 -0.522443
H  2.145431 1.83668 0.027272
H  0.971015 2.59776 1.161138
