program: Orca
programVersion: 5.0.2
elementType: Cl Cl N N N C C C C C C C C C C C C C H H H H H H H H H H H H H H H H
charge: 1
multiplicity: 1
keywords: wb97x-d3
keywords: def2-TZVPP
keywords: def2/J RIJCOSX
keywords: DEFGRID2
keywords: scfconv7
keywords: smallprint printgap noloewdin
keywords: NOSOSCF
formula: C13H16Cl2N3
InChI: InChI=1/C13H16Cl2N3/c1-2-3-10(7-18-9-16-8-17-18)12-5-4-11(14)6-13(12)15/h4-6,8-10,16H,2-3,7H2,1H3
34 atoms
Cl 0.082558 0.775812 -2.27949
Cl 4.501332 -0.665518 0.325452
N  -1.934375 -1.381333 -0.035941
N  -2.193902 -2.034022 1.104442
N  -1.04529 -3.287091 -0.25409
C  -1.318435 0.922202 0.594466
C  -1.564101 2.403508 0.271308
C  -2.295989 0.024179 -0.179062
C  0.129544 0.510518 0.447663
C  -2.961345 2.891663 0.64314
C  0.841939 0.438759 -0.749536
C  0.841778 0.19621 1.60547
C  -3.106475 4.394721 0.456886
C  2.179759 0.078258 -0.798937
C  2.177362 -0.162898 1.591192
C  -1.230517 -2.117259 -0.862618
C  2.845454 -0.220781 0.37874
C  -1.652324 -3.198389 0.960653
H  -1.563063 0.786485 1.652815
H  -0.82364 2.98337 0.827473
H  -1.371176 2.601332 -0.785247
H  -2.31833 0.249416 -1.242296
H  -3.306358 0.127306 0.210389
H  -3.720581 2.387363 0.037352
H  -3.175523 2.629569 1.683998
H  0.329631 0.247497 2.558443
H  -4.107433 4.729005 0.724992
H  -2.928854 4.686851 -0.578498
H  -2.398685 4.941173 1.080781
H  2.701097 0.046392 -1.745601
H  2.694503 -0.387328 2.513454
H  -0.875041 -1.826407 -1.838803
H  -1.678498 -3.992514 1.688507
H  -0.545288 -4.080113 -0.631274
totalener: -1589.51718105 hartree
nucrepener: 1593.62223022 hartree
electener: -3183.13941127 hartree
oneelecener: -5324.44798157 hartree
twoeener: 2141.30857030 hartree
kineticenergy: 1585.25101572 hartree
xcener: -108.731583532636 hartree
chargesum: 1.0000000
charge: -0.053727 -0.014605 0.136604 -0.229912 -0.113507 0.073570 -0.146835 -0.200805 0.047356 -0.101657 -0.139197 -0.152451 -0.260415 -0.073914 -0.113865 0.148207 0.045529 0.145495 0.089890 0.096723 0.091904 0.157205 0.149501 0.059169 0.074258 0.130300 0.098428 0.082305 0.084502 0.135743 0.143838 0.208483 0.190957 0.210924
qa: -0.0537 -0.0146 0.1366 -0.2299 -0.1135 0.0736 -0.1468 -0.2008 0.0474 -0.1017 -0.1392 -0.1525 -0.2604 -0.0739 -0.1139 0.1482 0.0455 0.1455 0.0899 0.0967 0.0919 0.1572 0.1495 0.0592 0.0743 0.1303 0.0984 0.0823 0.0845 0.1357 0.1438 0.2085 0.1910 0.2109
va: 1.2827 1.2912 3.4494 2.8953 3.5518 3.7030 3.8524 3.8403 3.4183 3.8826 4.0151 3.9505 3.9782 3.9591 4.0003 3.9107 4.0279 3.9304 1.0301 1.0145 1.0177 0.9909 1.0080 1.0073 1.0021 1.0095 1.0057 1.0017 1.0040 1.0130 1.0069 0.9968 0.9807 0.9911
dispersion: -0.017989921 hartree
energy: -1589.535170970933 hartree
dipole: -28.07282 25.97051 -2.10231 14.93500 -18.23409 -3.29909 8.37291 -8.50025 -0.12734
magnitude: 3.91406 au
magnitude: 9.94876 debye
