program: Orca
programVersion: 5.0.2
elementType: Cl Cl N N N C C C C C C C C C C C C C H H H H H H H H H H H H H H H H
charge: 1
multiplicity: 1
keywords: wb97x-d3
keywords: def2-TZVPP
keywords: def2/J RIJCOSX
keywords: DEFGRID2
keywords: scfconv7
keywords: smallprint printgap noloewdin
keywords: NOSOSCF
formula: C13H16Cl2N3
InChI: InChI=1/C13H16Cl2N3/c1-2-3-10(7-18-9-16-8-17-18)12-5-4-11(14)6-13(12)15/h4-6,8-10,16H,2-3,7H2,1H3
34 atoms
Cl -0.073972 0.507949 2.899046
Cl 4.3305 -0.243717 -0.026843
N  -1.900156 -1.585074 -0.52724
N  -2.619617 -1.755673 -1.645696
N  -0.822767 -2.984182 -1.694272
C  -1.609469 0.763935 0.24841
C  -2.221983 1.530021 -0.925666
C  -2.282113 -0.600526 0.48121
C  -0.112831 0.577123 0.183725
C  -1.689366 2.954153 -1.080793
C  0.659362 0.412863 1.335833
C  0.55566 0.476491 -1.035943
C  -1.869176 3.819473 0.158606
C  2.022502 0.161994 1.283519
C  1.915058 0.22755 -1.118749
C  -0.805055 -2.310255 -0.545757
C  2.645632 0.068136 0.049034
C  -1.957616 -2.614167 -2.349418
H  -1.847169 1.32352 1.156554
H  -2.10052 0.986569 -1.867172
H  -3.30223 1.575995 -0.758278
H  -3.367197 -0.524087 0.445108
H  -2.001241 -1.007982 1.451941
H  -0.633838 2.938313 -1.362265
H  -2.214197 3.413014 -1.921133
H  0.005266 0.618592 -1.957227
H  -1.260448 3.478498 0.997406
H  -2.910016 3.840589 0.486089
H  -1.572945 4.847294 -0.045231
H  2.591984 0.052448 2.196076
H  2.405753 0.176143 -2.080653
H  -0.048423 -2.358803 0.221218
H  -2.256421 -2.993283 -3.31278
H  -0.123391 -3.643855 -2.005925
totalener: -1589.51566644 hartree
nucrepener: 1610.05945997 hartree
electener: -3199.57512642 hartree
oneelecener: -5357.10618514 hartree
twoeener: 2157.53105872 hartree
kineticenergy: 1585.24182190 hartree
xcener: -108.734423242877 hartree
chargesum: 1.0000000
charge: -0.024757 -0.011085 0.147799 -0.244042 -0.108827 0.038158 -0.187569 -0.155876 -0.031650 -0.101381 -0.031382 -0.218830 -0.258654 -0.113924 -0.127297 0.121296 0.063514 0.154515 0.116015 0.075745 0.100784 0.146666 0.162697 0.075829 0.089959 0.152622 0.072143 0.090985 0.106069 0.136686 0.145411 0.214013 0.193252 0.211116
qa: -0.0248 -0.0111 0.1478 -0.2440 -0.1088 0.0382 -0.1876 -0.1559 -0.0316 -0.1014 -0.0314 -0.2188 -0.2587 -0.1139 -0.1273 0.1213 0.0635 0.1545 0.1160 0.0757 0.1008 0.1467 0.1627 0.0758 0.0900 0.1526 0.0721 0.0910 0.1061 0.1367 0.1454 0.2140 0.1933 0.2111
va: 1.3131 1.2944 3.4048 2.8865 3.5375 3.7826 3.9239 3.7903 3.3305 3.8835 4.0791 3.8263 3.9396 3.9921 4.0322 3.9678 4.0135 3.9044 1.0145 1.0165 1.0093 1.0150 1.0064 1.0059 1.0077 1.0020 1.0018 1.0032 1.0088 1.0164 1.0078 0.9723 0.9795 0.9909
dispersion: -0.019386210 hartree
energy: -1589.535052654887 hartree
dipole: -23.23610 21.56352 -1.67258 11.57889 -14.82236 -3.24347 -11.69046 9.74750 -1.94296
magnitude: 4.13434 au
magnitude: 10.50864 debye
