program: Orca
programVersion: 5.0.2
elementType: Cl Cl N N N C C C C C C C C C C C C C H H H H H H H H H H H H H H H H
charge: 1
multiplicity: 1
keywords: wb97x-d3
keywords: def2-TZVPP
keywords: def2/J RIJCOSX
keywords: DEFGRID2
keywords: scfconv7
keywords: smallprint printgap noloewdin
keywords: NOSOSCF
formula: C13H16Cl2N3
InChI: InChI=1/C13H16Cl2N3/c1-2-3-10(7-18-9-16-8-17-18)12-5-4-11(14)6-13(12)15/h4-6,8-10,16H,2-3,7H2,1H3
34 atoms
Cl -0.362766 -0.940662 2.031726
Cl 4.436026 0.177369 -0.019701
N  -1.831389 -1.487294 -0.953564
N  -2.698599 -2.202942 -0.225052
N  -0.87358 -3.334295 -0.577008
C  -1.556253 0.85379 -0.213222
C  -2.016376 2.282812 -0.516079
C  -2.117228 -0.094362 -1.281675
C  -0.056877 0.691663 -0.129167
C  -1.561477 3.292953 0.530726
C  0.570145 -0.090256 0.840454
C  0.772903 1.290076 -1.078154
C  -2.102934 4.68709 0.253274
C  1.947777 -0.251094 0.887947
C  2.147126 1.139648 -1.064256
C  -0.71892 -2.151519 -1.167488
C  2.732752 0.369304 -0.069083
C  -2.106766 -3.328509 -0.000983
H  -2.002811 0.572162 0.743007
H  -1.684341 2.60035 -1.510051
H  -3.110005 2.282469 -0.55858
H  -1.687495 0.113518 -2.261938
H  -3.199961 -0.01454 -1.358654
H  -1.891536 2.958856 1.518414
H  -0.470127 3.323811 0.571098
H  0.335697 1.912044 -1.849587
H  -1.771944 5.393604 1.012738
H  -3.193466 4.699464 0.24818
H  -1.763858 5.063259 -0.712819
H  2.401927 -0.844732 1.66902
H  2.759637 1.627862 -1.809256
H  0.14284 -1.809898 -1.718087
H  -2.524459 -4.151726 0.554397
H  -0.195617 -4.083384 -0.560472
totalener: -1589.51914116 hartree
nucrepener: 1607.56297646 hartree
electener: -3197.08211762 hartree
oneelecener: -5352.22818792 hartree
twoeener: 2155.14607029 hartree
kineticenergy: 1585.25469651 hartree
xcener: -108.734188300155 hartree
chargesum: 1.0000000
charge: -0.051297 -0.010630 0.130307 -0.218364 -0.100543 0.063983 -0.203154 -0.132353 -0.067468 -0.077546 0.007291 -0.191187 -0.251886 -0.102905 -0.126241 0.110019 0.058067 0.140815 0.112747 0.078236 0.095408 0.145188 0.143218 0.073221 0.077147 0.142032 0.099969 0.081535 0.078510 0.134762 0.146447 0.215462 0.189125 0.210085
qa: -0.0513 -0.0106 0.1303 -0.2184 -0.1005 0.0640 -0.2032 -0.1324 -0.0675 -0.0775 0.0073 -0.1912 -0.2519 -0.1029 -0.1262 0.1100 0.0581 0.1408 0.1127 0.0782 0.0954 0.1452 0.1432 0.0732 0.0771 0.1420 0.1000 0.0815 0.0785 0.1348 0.1464 0.2155 0.1891 0.2101
va: 1.2860 1.2950 3.4405 2.8857 3.5372 3.7408 3.9313 3.8151 3.3585 3.8670 3.9484 3.9596 3.9663 3.9781 4.0461 3.9728 4.0217 3.9426 1.0325 1.0075 1.0127 0.9929 1.0166 1.0078 1.0068 1.0061 1.0065 1.0029 1.0016 1.0170 1.0068 0.9723 0.9826 0.9919
dispersion: -0.018733777 hartree
energy: -1589.537874940277 hartree
dipole: -22.33012 20.79007 -1.54005 19.46900 -22.45032 -2.98133 -8.55718 6.86821 -1.68897
magnitude: 3.75668 au
magnitude: 9.54873 debye
