program: Orca
programVersion: 5.0.2
elementType: Cl Cl N N N C C C C C C C C C C C C C H H H H H H H H H H H H H H H H
charge: 1
multiplicity: 1
keywords: wb97x-d3
keywords: def2-TZVPP
keywords: def2/J RIJCOSX
keywords: DEFGRID2
keywords: scfconv7
keywords: smallprint printgap noloewdin
keywords: NOSOSCF
formula: C13H16Cl2N3
InChI: InChI=1/C13H16Cl2N3/c1-2-3-10(7-18-9-16-8-17-18)12-5-4-11(14)6-13(12)15/h4-6,8-10,16H,2-3,7H2,1H3
34 atoms
Cl -0.480486 -0.643896 1.989318
Cl 4.433316 0.204212 0.080753
N  -1.8301 -1.475672 -0.976307
N  -2.753367 -2.07931 -0.216571
N  -0.947918 -3.287225 -0.337012
C  -1.530693 0.92339 -0.482706
C  -1.951244 2.319395 -0.95619
C  -2.056787 -0.12276 -1.474374
C  -0.040802 0.754093 -0.307356
C  -1.476333 3.4490 -0.046188
C  0.525818 0.06546 0.764508
C  0.844996 1.248059 -1.265799
C  -1.938853 3.312543 1.397599
C  1.896259 -0.105884 0.898189
C  2.214336 1.0853 -1.166721
C  -0.728135 -2.185777 -1.051063
C  2.73787 0.409566 -0.073194
C  -2.207703 -3.184775 0.168178
H  -2.028544 0.739819 0.471261
H  -1.606607 2.500312 -1.978977
H  -3.044359 2.337159 -1.004827
H  -1.567333 -0.035476 -2.444682
H  -3.130848 -0.027714 -1.623059
H  -0.386894 3.523864 -0.07895
H  -1.851856 4.386456 -0.460575
H  0.455736 1.795464 -2.115513
H  -3.022579 3.200012 1.463007
H  -1.669979 4.19715 1.972811
H  -1.483669 2.458696 1.902383
H  2.301505 -0.624831 1.7557
H  2.870815 1.492136 -1.923102
H  0.170766 -1.931239 -1.589368
H  -2.67711 -3.926175 0.793461
H  -0.293836 -4.044272 -0.196256
totalener: -1589.51854044 hartree
nucrepener: 1626.33300958 hartree
electener: -3215.85155002 hartree
oneelecener: -5389.71618042 hartree
twoeener: 2173.86463040 hartree
kineticenergy: 1585.25342537 hartree
xcener: -108.735903141953 hartree
chargesum: 1.0000000
charge: -0.054540 -0.010468 0.129766 -0.218777 -0.099953 0.017621 -0.200603 -0.129319 -0.007754 -0.090909 -0.014384 -0.219540 -0.257969 -0.092354 -0.118940 0.108777 0.054318 0.140550 0.117065 0.086753 0.102366 0.144842 0.142978 0.075938 0.090399 0.144065 0.090100 0.106799 0.067773 0.135163 0.146417 0.215145 0.189529 0.209147
qa: -0.0545 -0.0105 0.1298 -0.2188 -0.1000 0.0176 -0.2006 -0.1293 -0.0078 -0.0909 -0.0144 -0.2195 -0.2580 -0.0924 -0.1189 0.1088 0.0543 0.1405 0.1171 0.0868 0.1024 0.1448 0.1430 0.0759 0.0904 0.1441 0.0901 0.1068 0.0678 0.1352 0.1464 0.2151 0.1895 0.2091
va: 1.2792 1.2954 3.4424 2.8878 3.5391 3.7486 3.9409 3.8091 3.2878 3.8823 3.9555 3.9745 3.9369 3.9644 4.0406 3.9758 4.0290 3.9419 1.0270 1.0089 1.0072 0.9947 1.0164 1.0074 1.0089 1.0040 1.0035 1.0093 1.0022 1.0164 1.0065 0.9723 0.9824 0.9923
dispersion: -0.019626838 hartree
energy: -1589.538167278051 hartree
dipole: -21.29457 19.74508 -1.54949 15.58298 -18.58456 -3.00159 -7.69034 6.14495 -1.54539
magnitude: 3.71466 au
magnitude: 9.44191 debye
