program: Orca
programVersion: 5.0.2
elementType: Cl Cl N N N C C C C C C C C C C C C C H H H H H H H H H H H H H H H H
charge: 1
multiplicity: 1
keywords: wb97x-d3
keywords: def2-TZVPP
keywords: def2/J RIJCOSX
keywords: DEFGRID2
keywords: scfconv7
keywords: smallprint printgap noloewdin
keywords: NOSOSCF
formula: C13H16Cl2N3
InChI: InChI=1/C13H16Cl2N3/c1-2-3-10(7-18-9-16-8-17-18)12-5-4-11(14)6-13(12)15/h4-6,8-10,16H,2-3,7H2,1H3
34 atoms
Cl -0.172529 -0.997085 2.03229
Cl 4.610489 -0.290478 -0.226912
N  -1.849713 -1.177289 -0.81723
N  -2.752028 -1.82604 -0.06966
N  -1.097276 -3.139879 -0.5902
C  -1.259182 1.087742 -0.006212
C  -1.551735 2.57749 -0.235322
C  -1.989459 0.252822 -1.068772
C  0.212754 0.750816 -0.0250
C  -2.962257 2.994384 0.171739
C  0.790921 -0.174726 0.844681
C  1.060733 1.33232 -0.968283
C  -3.198935 4.482963 -0.036995
C  2.139196 -0.498056 0.795927
C  2.406837 1.024486 -1.046601
C  -0.837752 -1.952531 -1.132321
C  2.943577 0.105957 -0.155744
C  -2.285432 -3.022759 0.063854
H  -1.674274 0.822051 0.968767
H  -0.830543 3.155753 0.346849
H  -1.381211 2.849526 -1.282643
H  -1.592411 0.455883 -2.063945
H  -3.058174 0.454408 -1.079256
H  -3.713482 2.433957 -0.392866
H  -3.121413 2.740672 1.223345
H  0.663113 2.064319 -1.659934
H  -2.497813 5.081796 0.545149
H  -4.204794 4.766754 0.268309
H  -3.083172 4.763081 -1.084758
H  2.558063 -1.203656 1.499768
H  3.036168 1.502924 -1.783803
H  0.024491 -1.6841 -1.721494
H  -2.763804 -3.821253 0.606461
H  -0.510171 -3.960079 -0.64777
totalener: -1589.51823330 hartree
nucrepener: 1597.65982977 hartree
electener: -3187.17806307 hartree
oneelecener: -5332.38942171 hartree
twoeener: 2145.21135864 hartree
kineticenergy: 1585.25022209 hartree
xcener: -108.733430521560 hartree
chargesum: 1.0000000
charge: -0.054410 -0.011253 0.127301 -0.219230 -0.099508 0.084308 -0.175363 -0.142980 -0.047600 -0.097370 -0.011641 -0.167868 -0.255466 -0.105464 -0.144610 0.107459 0.063498 0.141485 0.109857 0.111220 0.066929 0.143256 0.144877 0.056170 0.075512 0.142755 0.085589 0.099386 0.079368 0.134646 0.145552 0.215506 0.188600 0.209490
qa: -0.0544 -0.0113 0.1273 -0.2192 -0.0995 0.0843 -0.1754 -0.1430 -0.0476 -0.0974 -0.0116 -0.1679 -0.2555 -0.1055 -0.1446 0.1075 0.0635 0.1415 0.1099 0.1112 0.0669 0.1433 0.1449 0.0562 0.0755 0.1428 0.0856 0.0994 0.0794 0.1346 0.1456 0.2155 0.1886 0.2095
va: 1.2832 1.2943 3.4472 2.8838 3.5371 3.7162 3.9235 3.8172 3.3514 3.9026 3.9587 3.9744 3.9639 3.9815 4.0696 3.9760 4.0178 3.9426 1.0325 1.0086 1.0083 0.9939 1.0173 1.0099 1.0060 1.0030 1.0035 1.0066 1.0027 1.0175 1.0086 0.9721 0.9829 0.9922
dispersion: -0.018235544 hartree
energy: -1589.536468840402 hartree
dipole: -26.80134 25.03159 -1.76975 21.00448 -23.58492 -2.58045 -8.44894 6.83008 -1.61886
magnitude: 3.52298 au
magnitude: 8.95471 debye
