program: Gaussian 09
title: 000070906
version: EM64L-G09RevD.01
frameworkgroup: C1[X(C8H19N)]
method: RPBEPBE
basis: SDD
operation: Freq
keyword: #pfreq=noraman
keyword: PBEPBE/SDD
title: #p freq=noraman PBEPBE/SDD
converged: YES YES NO NO
title: Mulliken charges:
elementType: N C C C C C C C C H H H H H H H H H H H H H H H H H H H
charge: -0.348487 0.400879 -0.440779 -0.393635 -0.772190 -0.342177 -0.717796 -0.729921 -0.695080 0.196308 0.198175 0.197241 0.196951 0.237484 0.242170 0.210397 0.207104 0.218761 0.179102 0.241947 0.217949 0.203245 0.226087 0.218341 0.207843 0.199990 0.230496 0.209597
chargesum: 0.00000
title: Mulliken charges with hydrogens summed into heavy atoms:
elementType: N C C C C C C C C
charge: -0.111003 0.400879 -0.046296 0.000556 -0.112519 0.055686 -0.054655 -0.077651 -0.054997
polarizability: 1.02207877e+02 -4.81822722e-01 9.45656820e+01 9.63901659e-02 -1.83822316e-01 8.82076724e+01
1716.lowfreq: -22.8929 -9.4502 -0.0005 0.0005 0.0008 10.1296 57.9843 71.2056 100.7817
frequency: 57.7749 71.1162 100.7603 124.5885 158.7242 203.9092 214.5853 234.2108 240.9034 257.8265 289.8776 329.3117 347.9757 363.0449 445.0145 482.2816 530.0059 627.3396 711.4339 764.4019 783.4734 811.3653 870.9286 877.7848 945.6034 993.4886 1002.3332 1006.5181 1030.3139 1063.7884 1070.9618 1081.0313 1119.9022 1134.3110 1166.2157 1202.6767 1216.9088 1259.1384 1273.5785 1301.8450 1332.6034 1333.0688 1353.6169 1376.0857 1379.5277 1384.1747 1387.0919 1443.9969 1459.0599 1463.3849 1465.4854 1474.5226 1477.2595 1478.9045 1479.5152 1483.9208 1487.2934 1496.7466 1501.2394 2862.4455 2960.5364 2966.3486 2973.9101 2975.3412 2980.5736 2982.8453 3012.1462 3016.6751 3019.0595 3061.9399 3066.9353 3068.8573 3071.4211 3074.8060 3088.3529 3090.3875 3095.8896 3413.1910
redmass: 2.3562 1.7729 2.2673 1.9317 1.7272 1.3645 1.1738 1.9268 1.3623 1.2438 1.6683 2.5380 2.4750 2.4844 2.5245 2.4580 2.3378 1.7089 2.1974 1.2984 1.1943 1.1147 1.7783 1.7314 1.8619 1.5374 1.4959 1.6067 1.6375 2.3773 2.0974 2.4749 1.5518 2.8117 2.4521 2.1587 2.2500 1.1547 1.2998 1.3333 1.5071 1.4708 1.3495 1.2211 1.2048 1.2191 1.2346 1.1526 1.0658 1.0571 1.0638 1.0870 1.0506 1.0495 1.0464 1.0565 1.0802 1.0579 1.0781 1.0715 1.0597 1.0577 1.0378 1.0371 1.0362 1.0370 1.1004 1.0882 1.0968 1.0981 1.0985 1.0981 1.0990 1.0993 1.1000 1.1002 1.0991 1.0736
irintensity: 0.1066 1.1929 0.3729 0.4630 0.8290 0.2476 0.4956 0.4181 1.9278 0.4283 0.1262 0.2608 0.7068 2.5470 0.0438 11.6238 13.2869 80.9906 16.3686 4.3484 12.7212 3.6128 5.0312 7.6964 0.6676 11.7044 5.1525 4.5893 4.5531 1.2381 0.6388 2.6469 2.7786 45.5684 23.0027 23.6840 3.5777 5.5998 5.1738 13.9294 3.0745 5.7633 3.8332 19.4997 19.4573 19.0912 19.9404 14.1932 0.8495 7.6096 6.7574 17.4118 16.0267 7.7895 5.3403 13.6991 6.1976 3.9357 2.8906 101.2424 38.1089 31.6040 31.1550 41.4069 36.2907 25.5911 6.7436 14.1956 47.5156 48.8050 15.2291 96.8540 23.4550 72.1315 43.1006 35.4787 29.9794 4.8503
temp: 298.150 k
press: 1.00000 atm
elementType: 7 6 6 6 6 6 6 6 6 1 1 1 1 1 1 1 1 1 1 1 1 1 1 1 1 1 1 1
symmnumber: 1
zpe: 674732.2 jmol-1
zpe.correction: 0.256992 hartree
zpe.thermalcorrener: 0.269450 hartree
zpe.thermalcorrenthalpy: 0.270394 hartree
zpe.thermalcorrgfe: 0.219385 hartree
zpe.sumelectzpe: -370.208479 hartree
zpe.sumelectthermal: -370.196021 hartree
zpe.sumelectthermalent: -370.195077 hartree
zpe.sumelectthermalfe: -370.246086 hartree
dipole: -0.1368 0.9768 -0.0387
dipole: 0.9871
quadrupole: -58.5646 -62.2324 -58.8264
quadrupole: -0.0734 0.0555 -0.5869
quadrupole: 1.3099 -2.3580 1.0481 -0.0734 0.0555 -0.5869
hfenergy: -370.4654713 hartree
pointgroup: C01 [X(C8H19N1)]
dipole: -0.0786074 -0.3800838 0.0132271 debye
polarizability: 102.18744|-0.0302719|94.5396061|-0.8481205|-0.0727204|88.2541849 unknown
InChI: InChI=1S/C8H19N/c1-5-8(4,6-2)9-7-3/h9H,5-7H2,1-4H3
charge 0 multiplicity 1
28 atoms
N  -0.67451 0.439126 0.353552
C  0.521182 -0.100418 -0.366574
C  1.765726 0.235499 0.514868
C  0.447811 -1.653458 -0.606867
C  0.643863 0.591504 -1.748609
C  -2.014615 0.250673 -0.243441
C  2.057407 1.74189 0.685797
C  0.279215 -2.518041 0.660807
C  -3.087164 0.910122 0.643277
H  1.616887 -0.214192 1.518734
H  2.648681 -0.271816 0.076323
H  -0.39715 -1.859298 -1.295116
H  1.365003 -1.96534 -1.147054
H  -0.669771 0.137161 1.339342
H  0.543005 1.684937 -1.646234
H  1.627035 0.367003 -2.202069
H  -0.133569 0.237151 -2.450425
H  -2.024841 0.729874 -1.240065
H  -2.284762 -0.823368 -0.402639
H  1.148094 2.269829 1.022732
H  2.387829 2.203793 -0.261959
H  2.857189 1.904451 1.432299
H  1.147397 -2.435115 1.339309
H  0.170176 -3.584854 0.391998
H  -0.625168 -2.22949 1.230687
H  -3.111622 0.44908 1.650094
H  -2.872842 1.986172 0.76699
H  -4.092384 0.796526 0.197946
