program: Orca
programVersion: 5.0.2
elementType: Cl Cl N N N C C C C C C C C C C C C C H H H H H H H H H H H H H H H H
charge: 1
multiplicity: 1
keywords: wb97x-d3
keywords: def2-TZVPP
keywords: def2/J RIJCOSX
keywords: DEFGRID2
keywords: scfconv7
keywords: smallprint printgap noloewdin
keywords: NOSOSCF
formula: C13H16Cl2N3
InChI: InChI=1/C13H16Cl2N3/c1-2-3-10(7-18-9-16-8-17-18)12-5-4-11(14)6-13(12)15/h4-6,8-10,16H,2-3,7H2,1H3
34 atoms
Cl -0.415192 -0.37754 3.040676
Cl -4.466344 0.855705 -0.217647
N  1.916235 1.118804 -0.460313
N  2.618677 0.997125 -1.601667
N  1.139597 2.58686 -1.768163
C  1.211945 -1.064098 0.50349
C  1.703073 -2.028293 -0.580638
C  2.086209 0.193256 0.647467
C  -0.229477 -0.645348 0.338834
C  3.018027 -2.712539 -0.226089
C  -1.030317 -0.281712 1.421317
C  -0.79844 -0.515849 -0.927374
C  3.483267 -3.660618 -1.320271
C  -2.330872 0.172994 1.268033
C  -2.091034 -0.056392 -1.11777
C  1.012323 2.067597 -0.554371
C  -2.848708 0.281494 -0.010624
C  2.132795 1.904487 -2.387316
H  1.318583 -1.580337 1.461587
H  0.937715 -2.796662 -0.72451
H  1.806716 -1.52108 -1.543668
H  3.142942 -0.055678 0.702609
H  1.831899 0.739611 1.554126
H  3.79992 -1.970927 -0.042692
H  2.892888 -3.263068 0.710818
H  -0.216501 -0.773716 -1.80256
H  3.680661 -3.125464 -2.250688
H  2.732236 -4.423889 -1.531862
H  4.402251 -4.173759 -1.035422
H  -2.924667 0.439525 2.131435
H  -2.493142 0.03512 -2.117141
H  0.319108 2.380911 0.209702
H  2.464821 2.107435 -3.391242
H  0.597569 3.356019 -2.146556
elementType: Cl N C H
totalener: -1589.61004053 hartree
nucrepener: 1589.78029526 hartree
electener: -3179.39033579 hartree
oneelecener: -5315.85462400 hartree
twoeener: 2136.46428821 hartree
cpcmener: -0.11358451 hartree
kineticenergy: 1585.21786290 hartree
xcener: -108.727839476269 hartree
chargesum: 1.0000000
charge: -0.081946 -0.085774 0.142738 -0.305961 -0.082135 0.158825 -0.193590 -0.127229 -0.049258 -0.082240 0.003677 -0.165664 -0.292895 -0.137737 -0.152495 0.156488 0.102604 0.161596 0.081338 0.103360 0.069017 0.145105 0.148929 0.064593 0.064829 0.154349 0.081696 0.081229 0.092260 0.124700 0.147642 0.223304 0.200283 0.248360
qa: -0.0819 -0.0858 0.1427 -0.3060 -0.0821 0.1588 -0.1936 -0.1272 -0.0493 -0.0822 0.0037 -0.1657 -0.2929 -0.1377 -0.1525 0.1565 0.1026 0.1616 0.0813 0.1034 0.0690 0.1451 0.1489 0.0646 0.0648 0.1543 0.0817 0.0812 0.0923 0.1247 0.1476 0.2233 0.2003 0.2484
va: 1.2466 1.2166 3.4253 2.8899 3.5525 3.7432 3.9315 3.8415 3.5253 3.8664 3.9903 3.8684 3.9514 4.0794 4.0491 3.9375 3.8588 3.9305 1.0291 1.0096 1.0196 1.0031 1.0075 1.0122 1.0065 0.9970 0.9999 1.0005 1.0040 1.0213 1.0043 0.9646 0.9775 0.9645
dispersion: -0.018476835 hartree
energy: -1589.628517368475 hartree
dipole: 29.59992 -27.09190 2.50802 -13.98583 17.79217 3.80634 -13.06981 10.69701 -2.37280
magnitude: 5.13893 au
magnitude: 13.06211 debye
