program: Orca
programVersion: 5.0.2
elementType: Cl Cl N N N C C C C C C C C C C C C C H H H H H H H H H H H H H H H H
charge: 1
multiplicity: 1
keywords: wb97x-d3
keywords: def2-TZVPP
keywords: def2/J RIJCOSX
keywords: DEFGRID2
keywords: scfconv7
keywords: smallprint printgap noloewdin
keywords: NOSOSCF
formula: C13H16Cl2N3
InChI: InChI=1/C13H16Cl2N3/c1-2-3-10(7-18-9-16-8-17-18)12-5-4-11(14)6-13(12)15/h4-6,8-10,16H,2-3,7H2,1H3
34 atoms
Cl 0.034844 -0.691896 2.909957
Cl -4.331491 0.220761 -0.033011
N  1.915408 1.582135 -0.553036
N  2.577719 1.674264 -1.72049
N  0.848145 2.996829 -1.705372
C  1.617323 -0.758984 0.256564
C  2.221373 -1.539214 -0.911953
C  2.282316 0.610992 0.464257
C  0.118945 -0.590918 0.192149
C  1.672742 -2.955437 -1.062991
C  -0.67299 -0.505374 1.33688
C  -0.531241 -0.411689 -1.028229
C  1.827295 -3.81626 0.182111
C  -2.036696 -0.259736 1.285082
C  -1.890518 -0.163739 -1.117252
C  0.862752 2.368667 -0.537445
C  -2.633039 -0.090058 0.048103
C  1.91393 2.546159 -2.410139
H  1.870025 -1.303294 1.168899
H  2.096573 -1.003178 -1.855248
H  3.300126 -1.59121 -0.739138
H  3.366389 0.519978 0.453361
H  1.992134 1.036994 1.422979
H  0.619869 -2.922519 -1.354842
H  2.197255 -3.429473 -1.895968
H  0.037066 -0.461101 -1.948196
H  1.512335 -4.841802 -0.013464
H  1.224903 -3.450242 1.01536
H  2.866308 -3.849111 0.516226
H  -2.61942 -0.200844 2.193921
H  -2.355623 -0.028631 -2.083752
H  0.161957 2.498068 0.271681
H  2.164907 2.882556 -3.401606
H  0.16669 3.689027 -1.996906
elementType: Cl N C H
totalener: -1589.60987625 hartree
nucrepener: 1608.71325418 hartree
electener: -3198.32313043 hartree
oneelecener: -5353.78774545 hartree
twoeener: 2155.46461502 hartree
cpcmener: -0.11409577 hartree
kineticenergy: 1585.22274277 hartree
xcener: -108.730330487743 hartree
chargesum: 1.0000000
charge: -0.082917 -0.085136 0.132286 -0.304711 -0.083491 0.073287 -0.184441 -0.076767 -0.025806 -0.102253 0.009997 -0.197212 -0.274152 -0.132160 -0.127265 0.155297 0.091994 0.161609 0.092219 0.082886 0.095511 0.134740 0.145952 0.068498 0.074874 0.159673 0.094356 0.073051 0.085717 0.124651 0.148004 0.223561 0.199566 0.248582
qa: -0.0829 -0.0851 0.1323 -0.3047 -0.0835 0.0733 -0.1844 -0.0768 -0.0258 -0.1023 0.0100 -0.1972 -0.2742 -0.1322 -0.1273 0.1553 0.0920 0.1616 0.0922 0.0829 0.0955 0.1347 0.1460 0.0685 0.0749 0.1597 0.0944 0.0731 0.0857 0.1247 0.1480 0.2236 0.1996 0.2486
va: 1.2435 1.2176 3.4432 2.9004 3.5522 3.7807 3.9120 3.8242 3.4801 3.8966 3.9786 3.8569 3.9311 4.0698 4.0242 3.9386 3.8674 3.9313 1.0220 1.0180 1.0063 1.0125 1.0045 1.0074 1.0070 0.9939 1.0054 1.0011 1.0017 1.0209 1.0028 0.9638 0.9781 0.9644
dispersion: -0.019452253 hartree
energy: -1589.629328502868 hartree
dipole: 23.32081 -21.20309 2.11772 -10.64939 15.23542 4.58604 -11.54581 9.15219 -2.39361
magnitude: 5.58980 au
magnitude: 14.20814 debye
