program: Gaussian 09
title: 000070920
version: EM64L-G09RevD.01
frameworkgroup: C1[X(C9H17N)]
method: RPBEPBE
basis: SDD
operation: Freq
keyword: #pfreq=noraman
keyword: PBEPBE/SDD
title: #p freq=noraman PBEPBE/SDD
converged: YES YES NO NO
title: Mulliken charges:
elementType: N C C C C C C C C C H H H H H H H H H H H H H H H H H
charge: -0.353784 0.254557 0.111909 -0.745800 -0.683035 -0.681836 -0.701271 -0.698562 0.247961 -0.559683 0.262741 0.229827 0.216414 0.210422 0.226051 0.224224 0.195679 0.221925 0.203120 0.214936 0.230853 0.212576 0.215103 0.220256 0.217305 0.229935 0.278179
chargesum: 0.00000
title: Mulliken charges with hydrogens summed into heavy atoms:
elementType: N C C C C C C C C C
charge: -0.091043 0.254557 0.111909 -0.089137 -0.037080 -0.041855 -0.042740 -0.031067 0.247961 -0.281504
polarizability: 1.12890685e+02 -8.80374090e+00 1.08198562e+02 -2.50189034e-03 -8.32525790e-01 8.85040794e+01
1716.lowfreq: -21.8154 -10.0930 -0.0007 -0.0006 -0.0001 5.7023 53.3184 105.9720 140.9851
frequency: 52.6275 105.9593 140.9249 165.8102 181.1333 193.9891 226.6332 234.7860 255.1555 284.9658 294.7092 306.4238 325.6081 357.1601 380.6769 405.3101 450.2281 470.9961 531.2800 556.6388 597.2536 627.8357 632.9773 707.4431 747.6949 851.5939 901.5015 911.5424 924.0642 936.6752 940.2363 999.4424 1017.3722 1023.5144 1029.0518 1145.1246 1187.9660 1195.6949 1215.7985 1229.4890 1256.6238 1366.3125 1370.6549 1373.8808 1387.7486 1397.7144 1447.8357 1449.6369 1459.1074 1461.6702 1463.5810 1471.4379 1473.6333 1474.7013 1487.0290 1495.1182 1500.9374 2103.5259 2970.6711 2978.6009 2985.3110 2986.1167 2995.9053 3064.9524 3071.1444 3077.9469 3083.8827 3088.3386 3089.9665 3094.2604 3101.1996 3103.6864 3107.0165 3423.2607 3435.0440
redmass: 2.7231 3.0771 1.6352 3.0015 1.8597 2.0022 1.0897 1.0877 1.0598 1.4527 1.9196 1.8999 2.7105 2.3065 2.4213 2.6054 1.7724 2.4842 2.9275 3.0055 4.6496 1.2306 1.2279 3.2021 3.2517 2.2287 1.6851 1.7260 1.9114 1.3566 1.3638 1.5327 1.4770 1.5276 1.5133 2.6406 2.4720 2.7496 2.8292 3.0345 3.4947 1.2158 1.2003 1.2023 1.1960 1.2033 1.0663 1.0579 1.0488 1.0550 1.0491 1.0583 1.0606 1.0659 1.0775 1.0523 1.1256 6.0561 1.0361 1.0360 1.0345 1.0365 1.0349 1.0986 1.0987 1.0988 1.0997 1.0997 1.0989 1.1004 1.1005 1.0994 1.1005 1.1564 1.0743
irintensity: 0.0109 0.7265 0.5839 1.1323 0.4176 1.1402 0.2040 0.0993 0.1107 0.9781 0.4536 0.9292 1.9714 1.8725 2.8081 2.2720 18.5090 8.0909 30.0631 29.6890 17.4250 80.6321 74.5483 11.0673 1.6028 1.3205 0.1845 3.2337 0.8141 0.6342 1.0758 4.3786 0.8519 1.6421 0.3919 2.6450 66.8580 32.6963 79.0700 54.0326 30.1015 16.2038 19.2148 30.0230 36.4980 9.5358 7.7456 0.0576 1.1737 1.1931 2.1642 17.2461 0.7028 12.7064 26.4906 8.4579 0.9617 5.6136 30.4836 23.9904 32.0400 20.3133 18.2585 24.9955 23.7193 33.1603 22.9101 34.6174 77.6935 26.3462 26.6660 20.3338 41.9823 60.7225 1.6846
temp: 298.150 k
press: 1.00000 atm
elementType: 7 6 6 6 6 6 6 6 6 6 1 1 1 1 1 1 1 1 1 1 1 1 1 1 1 1 1
symmnumber: 1
zpe: 621111.5 jmol-1
zpe.correction: 0.236569 hartree
zpe.thermalcorrener: 0.249756 hartree
zpe.thermalcorrenthalpy: 0.250700 hartree
zpe.thermalcorrgfe: 0.199081 hartree
zpe.sumelectzpe: -407.011534 hartree
zpe.sumelectthermal: -406.998347 hartree
zpe.sumelectthermalent: -406.997403 hartree
zpe.sumelectthermalfe: -407.049022 hartree
dipole: 0.3791 0.1583 0.2365
dipole: 0.4740
quadrupole: -63.1802 -62.5176 -63.1695
quadrupole: 0.6818 -0.0169 1.0262
quadrupole: -0.2244 0.4382 -0.2137 0.6818 -0.0169 1.0262
hfenergy: -407.2481029 hartree
pointgroup: C01 [X(C9H17N1)]
dipole: -0.1466903 0.0702073 -0.0912957 debye
polarizability: 113.5719562|8.5917539|107.4688937|0.2039612|1.2634142|88.5524761 unknown
InChI: InChI=1S/C9H17N/c1-7-9(5,6)10-8(2,3)4/h1,10H,2-6H3
charge 0 multiplicity 1
27 atoms
N  -0.262301 -0.433902 -0.655761
C  -1.498195 0.125189 -0.003985
C  1.094224 -0.509948 -0.034702
C  -2.462045 0.441766 -1.180207
C  -2.173488 -0.952791 0.888689
C  -1.270105 1.426103 0.818645
C  1.96468 -1.344948 -1.022878
C  1.077122 -1.23216 1.338656
C  1.756037 0.829979 0.116816
C  2.321409 1.926606 0.177992
H  -0.168589 -0.062473 -1.611126
H  -2.62749 -0.460933 -1.796481
H  -3.438566 0.784911 -0.796331
H  -2.052423 1.241112 -1.828071
H  -1.571966 -1.189193 1.781296
H  -2.31324 -1.882612 0.310071
H  -3.161697 -0.595818 1.23553
H  -0.824485 2.21978 0.19354
H  -2.236093 1.791462 1.215624
H  -0.596356 1.258923 1.677266
H  1.529137 -2.354071 -1.120646
H  1.989835 -0.871946 -2.021788
H  3.002749 -1.423307 -0.655902
H  2.114539 -1.395976 1.678882
H  0.560232 -0.640044 2.11124
H  0.572952 -2.208255 1.234929
H  2.799724 2.886546 0.243705
