program: Orca
programVersion: 5.0.2
elementType: Cl Cl O O N C C C C C C C C C C C C C C C C H H H H H H H H H H H H H H H H H H H H H H
charge: 1
multiplicity: 1
keywords: wb97x-d3
keywords: def2-TZVPP
keywords: def2/J RIJCOSX
keywords: DEFGRID2
keywords: scfconv7
keywords: smallprint printgap noloewdin
keywords: NOSOSCF
formula: C16H22Cl2NO2
InChI: InChI=1/C16H22Cl2NO2/c1-12-5-2-3-8-19(12)9-4-10-21-16(20)13-6-7-14(17)15(18)11-13/h6-7,11-12,19H,2-5,8-10H2,1H3
43 atoms
Cl 3.561173 0.358194 2.317483
Cl 4.445782 0.386771 -0.698022
O  -1.973017 1.827366 -0.148025
O  -1.433624 2.159386 2.000118
N  -2.574297 -1.00851 -0.721996
C  -2.082519 -2.161289 0.125817
C  -0.667482 -2.525271 -0.305569
C  -2.523934 -1.35312 -2.180583
C  -0.574462 -2.873051 -1.782012
C  -1.125547 -1.730936 -2.617211
C  -3.947823 -0.510522 -0.352805
C  -2.142897 -1.845446 1.606928
C  -3.986266 0.660185 0.618245
C  -3.382291 1.955888 0.109374
C  -1.11747 1.898396 0.868195
C  0.26545 1.568271 0.444002
C  1.175386 1.207064 1.430508
C  0.656836 1.56983 -0.89214
C  2.461246 0.833307 1.084566
C  1.948733 1.216377 -1.234989
C  2.852392 0.840214 -0.251881
H  -2.765002 -2.983896 -0.104829
H  -0.345947 -3.367596 0.309007
H  0.004901 -1.692399 -0.068563
H  -2.879665 -0.47898 -2.723993
H  -3.232858 -2.167837 -2.335088
H  -1.141545 -3.786735 -1.982517
H  0.461949 -3.077264 -2.054502
H  -0.471192 -0.857273 -2.538445
H  -1.169268 -1.995308 -3.674994
H  -4.434825 -0.219207 -1.28241
H  -4.500941 -1.360096 0.045404
H  -1.56205 -0.957503 1.86216
H  -3.159121 -1.723301 1.977253
H  -1.708212 -2.685117 2.148928
H  -5.046876 0.860776 0.789537
H  -3.573552 0.400405 1.592001
H  -3.569908 2.766619 0.813846
H  -3.813061 2.23731 -0.850921
H  0.881108 1.198899 2.471513
H  -0.028849 1.857244 -1.676721
H  2.256107 1.230465 -2.27174
H  -1.913442 -0.238143 -0.592915
elementType: Cl O N C H
totalener: -1748.55623865 hartree
nucrepener: 2088.14281341 hartree
electener: -3836.69905206 hartree
oneelecener: -6524.02990473 hartree
twoeener: 2687.33085267 hartree
cpcmener: -0.09960685 hartree
kineticenergy: 1743.36387022 hartree
xcener: -123.757955468707 hartree
chargesum: 1.0000000
charge: -0.052947 -0.046909 -0.291958 -0.427902 0.184733 0.055561 -0.171827 -0.090640 -0.095576 -0.161298 -0.091285 -0.310998 -0.161655 0.016687 0.497980 0.020282 -0.143098 -0.248880 0.057537 -0.089872 0.050930 0.108873 0.097323 0.078238 0.122918 0.140058 0.080294 0.082875 0.086228 0.098017 0.123981 0.133358 0.098873 0.109618 0.115686 0.108363 0.112627 0.121154 0.116838 0.127541 0.155664 0.147587 0.135021
qa: -0.0529 -0.0469 -0.2920 -0.4279 0.1847 0.0556 -0.1718 -0.0906 -0.0956 -0.1613 -0.0913 -0.3110 -0.1617 0.0167 0.4980 0.0203 -0.1431 -0.2489 0.0575 -0.0899 0.0509 0.1089 0.0973 0.0782 0.1229 0.1401 0.0803 0.0829 0.0862 0.0980 0.1240 0.1334 0.0989 0.1096 0.1157 0.1084 0.1126 0.1212 0.1168 0.1275 0.1557 0.1476 0.1350
va: 1.2635 1.2735 2.1091 2.0760 3.6030 3.7848 3.9200 3.8362 3.8784 3.9451 3.8678 3.9500 3.8775 3.8427 4.0687 3.5476 4.0668 4.0265 3.9694 3.9383 3.9680 1.0109 1.0173 1.0143 1.0022 0.9983 1.0120 1.0140 1.0135 1.0154 0.9988 1.0006 1.0031 1.0007 1.0076 1.0172 1.0181 1.0113 1.0005 1.0388 1.0143 1.0049 1.0765
dispersion: -0.026111668 hartree
energy: -1748.582350315174 hartree
dipole: -50.20795 44.45199 -5.75596 -19.31503 17.05871 -2.25632 -13.12159 10.33294 -2.78865
magnitude: 6.78223 au
magnitude: 17.23907 debye
