program: Gaussian 09
title: 000070904
version: EM64L-G09RevD.01
frameworkgroup: C1[X(C9H21N)]
method: RPBEPBE
basis: SDD
operation: Freq
keyword: #pfreq=noraman
keyword: PBEPBE/SDD
title: #p freq=noraman PBEPBE/SDD
converged: YES YES NO NO
title: Mulliken charges:
elementType: N C C C C C C C C C H H H H H H H H H H H H H H H H H H H H H
charge: -0.368581 0.450150 -0.486325 -0.417412 -0.418177 -0.349398 -0.730337 -0.727128 -0.734160 -0.698850 0.235956 0.191298 0.202060 0.192695 0.204200 0.197636 0.242997 0.183534 0.212312 0.214858 0.219847 0.224988 0.247639 0.213451 0.202897 0.212282 0.222580 0.217714 0.229759 0.200489 0.211026
chargesum: 0.00000
title: Mulliken charges with hydrogens summed into heavy atoms:
elementType: N C C C C C C C C C
charge: -0.125583 0.450150 -0.059070 -0.022657 -0.016341 0.046448 -0.070644 -0.063141 -0.081585 -0.057576
polarizability: 1.16501666e+02 9.06898091e-02 1.06852746e+02 7.62232298e-01 -5.82101512e-01 9.35249024e+01
1716.lowfreq: -7.9120 -0.0008 -0.0004 0.0002 7.1659 27.4470 58.7173 70.0479 87.5338
frequency: 58.2134 69.9860 87.5011 111.7236 135.0871 143.3092 197.3409 218.8240 224.6784 236.6820 271.0798 304.1461 326.7994 332.9341 339.0250 384.5359 410.9209 508.5274 534.0120 594.9720 695.4769 749.6242 782.2084 792.0514 814.5678 884.1233 909.4836 931.9930 978.8572 1007.3893 1023.6528 1040.5444 1054.9762 1065.3945 1077.3852 1089.3936 1122.3060 1139.3001 1163.5687 1182.9450 1230.4945 1251.0007 1261.6254 1266.6870 1293.9138 1324.3951 1330.9595 1344.3147 1355.3178 1380.7551 1386.3724 1389.4389 1390.4217 1451.0375 1459.2934 1465.5492 1470.4269 1475.2502 1477.8230 1479.9065 1482.3186 1485.5403 1489.5955 1489.8914 1501.0198 1505.1484 2863.7740 2968.1756 2970.4085 2974.7242 2975.6261 2976.5401 2980.8090 2981.9431 3006.1706 3014.8904 3023.6309 3033.2145 3064.5811 3067.3161 3069.0862 3070.6259 3072.6106 3078.0190 3085.2803 3089.5365 3423.3232
redmass: 2.1663 2.1143 2.2745 2.2666 2.7556 1.2898 1.8724 1.1311 1.2676 1.2424 1.5556 2.1931 2.0443 2.5150 2.2530 3.2487 3.1537 1.7914 2.1990 1.8176 2.3389 1.2153 1.4306 1.1875 1.1193 1.8122 1.9574 1.4685 2.1355 1.5078 1.6038 1.7137 2.7611 1.6366 2.1942 2.7421 1.5904 2.1962 2.3677 2.5056 2.7032 1.1746 1.2151 1.1717 1.2689 1.5098 1.4136 1.4946 1.4225 1.2132 1.2330 1.2186 1.2120 1.1821 1.0663 1.0502 1.0632 1.0652 1.0675 1.0513 1.0504 1.0456 1.0594 1.0581 1.0780 1.0703 1.0716 1.0622 1.0602 1.0373 1.0400 1.0522 1.0364 1.0437 1.0860 1.0988 1.0979 1.0942 1.0984 1.0979 1.0990 1.0982 1.0994 1.0998 1.0997 1.1002 1.0738
irintensity: 0.2245 0.6767 0.1398 0.4882 0.6499 0.2865 1.8843 0.0168 0.3911 0.7060 3.0095 1.1774 0.7983 1.5338 1.8974 0.0607 1.3847 42.3620 2.9386 65.5275 6.0799 2.1134 9.0685 2.5761 5.0145 5.9271 17.5929 5.9558 12.8077 4.2218 0.9983 5.4870 2.8094 4.4496 0.6891 6.2848 3.6352 14.4677 24.9877 35.5822 3.9014 0.0504 3.0715 2.1775 6.1481 2.1269 4.6907 5.6776 1.3775 22.4678 21.8102 14.5129 12.0919 16.7551 1.3761 6.1038 12.2200 5.3278 22.1763 1.4593 19.2907 7.8626 10.3009 15.0542 5.7843 0.8873 95.6454 16.3589 29.3727 28.7070 57.7109 55.0701 27.3777 22.3083 27.2306 2.7409 47.1407 15.6349 55.0282 20.6121 71.5817 57.8559 64.9754 44.2108 39.9606 39.2438 4.2492
temp: 298.150 k
press: 1.00000 atm
elementType: 7 6 6 6 6 6 6 6 6 6 1 1 1 1 1 1 1 1 1 1 1 1 1 1 1 1 1 1 1 1 1
symmnumber: 1
zpe: 749007.8 jmol-1
zpe.correction: 0.285282 hartree
zpe.thermalcorrener: 0.299010 hartree
zpe.thermalcorrenthalpy: 0.299954 hartree
zpe.thermalcorrgfe: 0.246073 hartree
zpe.sumelectzpe: -409.430133 hartree
zpe.sumelectthermal: -409.416405 hartree
zpe.sumelectthermalent: -409.415461 hartree
zpe.sumelectthermalfe: -409.469342 hartree
dipole: 0.0537 0.9009 0.2167
dipole: 0.9282
quadrupole: -65.2131 -67.8750 -66.1106
quadrupole: 0.6881 0.7033 -1.5081
quadrupole: 1.1865 -1.4755 0.2889 0.6881 0.7033 -1.5081
hfenergy: -409.7154147 hartree
pointgroup: C01 [X(C9H21N1)]
dipole: -0.0126167 -0.3545151 0.0866554 debye
polarizability: 116.5126042|0.3693789|106.8724832|-0.1476752|0.5047036|93.4942277 unknown
InChI: InChI=1S/C9H21N/c1-5-9(6-2,7-3)10-8-4/h10H,5-8H2,1-4H3
charge 0 multiplicity 1
31 atoms
N  -0.952619 0.031709 -0.551741
C  0.375179 0.002069 0.139774
C  1.427994 0.022219 -1.012363
C  0.506706 1.265402 1.050042
C  0.552982 -1.261728 1.056532
C  -2.192858 -0.080023 0.243099
C  2.909045 0.044485 -0.582094
C  0.374011 2.617048 0.319798
C  0.394261 -2.621479 0.34435
C  -3.421061 -0.025877 -0.684954
H  1.209411 0.903526 -1.643713
H  1.256166 -0.864046 -1.658676
H  1.477702 1.213688 1.580918
H  -0.266733 1.201485 1.842044
H  1.546043 -1.213842 1.545734
H  -0.188485 -1.196537 1.878848
H  -0.966147 -0.618684 -1.350311
H  -2.246893 -1.011533 0.859826
H  -2.238584 0.768858 0.951616
H  3.565951 0.076324 -1.470987
H  3.185452 -0.852928 0.000969
H  3.142211 0.933218 0.03207
H  -0.53592 2.621552 -0.305971
H  1.238523 2.813407 -0.340821
H  0.312451 3.451559 1.042965
H  -0.583343 -2.695692 -0.169472
H  1.185396 -2.787927 -0.40958
H  0.449483 -3.452343 1.071569
H  -3.422958 0.913207 -1.265959
H  -3.416219 -0.870639 -1.401353
H  -4.358646 -0.085176 -0.102856
