program: Orca
programVersion: 5.0.2
elementType: Cl O N N N C C C C C C C C C C C C C C C C H H H H H H H H H H H H H H H H H H H H H H H
charge: 1
multiplicity: 1
keywords: wb97x-d3
keywords: def2-TZVPP
keywords: def2/J RIJCOSX
keywords: DEFGRID2
keywords: scfconv7
keywords: smallprint printgap noloewdin
keywords: NOSOSCF
formula: C16H23ClN3O
InChI: InChI=1/C16H23ClN3O/c1-15(2,3)16(21,10-20-12-18-11-19-20)9-8-13-4-6-14(17)7-5-13/h4-7,11-12,19,21H,8-10H2,1-3H3
44 atoms
Cl -4.800042 0.025696 1.220842
O  2.997618 -0.803906 -1.243499
N  0.493258 -1.617579 -0.243932
N  0.799797 -2.334372 -1.3298
N  -1.278072 -2.756739 -0.837511
C  2.307838 0.106569 -0.384972
C  3.351613 0.858142 0.525962
C  1.47171 1.016035 -1.310048
C  1.448424 -0.801503 0.499103
C  2.732819 1.396467 1.822379
C  4.483183 -0.094498 0.93803
C  3.9858 2.028292 -0.232749
C  0.515801 2.074287 -0.745885
C  -0.799394 1.55142 -0.233967
C  -0.76982 -1.895097 0.032089
C  -1.725014 1.001029 -1.120394
C  -1.14607 1.622017 1.111696
C  -0.283486 -3.003433 -1.67433
C  -2.954555 0.533147 -0.685364
C  -2.370413 1.153159 1.569938
C  -3.266742 0.612787 0.66347
H  0.90016 0.375501 -1.988127
H  2.181441 1.534728 -1.95846
H  2.07422 -1.480963 1.078523
H  0.844717 -0.229403 1.196707
H  3.473382 2.004481 2.344708
H  2.443637 0.598156 2.508013
H  1.860482 2.026546 1.660822
H  5.129489 0.415381 1.654704
H  5.109676 -0.393497 0.098541
H  4.121127 -0.999799 1.428355
H  4.414017 1.722205 -1.189918
H  3.280053 2.837534 -0.42272
H  4.799782 2.444881 0.363009
H  0.301829 2.755355 -1.573135
H  0.99765 2.684309 0.015962
H  3.460268 -0.306722 -1.929801
H  -1.277662 -1.472085 0.884825
H  -1.487578 0.939285 -2.176002
H  -0.451827 2.0505 1.82415
H  -0.312917 -3.650657 -2.535658
H  -3.658194 0.112887 -1.391297
H  -2.617236 1.216689 2.62114
H  1.717487 -2.219674 -1.763387
elementType: Cl O N C H
totalener: -1323.17439445 hartree
nucrepener: 1955.10974199 hartree
electener: -3278.28413643 hartree
oneelecener: -5668.38703637 hartree
twoeener: 2390.10289993 hartree
cpcmener: -0.11281534 hartree
kineticenergy: 1318.48158655 hartree
xcener: -106.548175788318 hartree
chargesum: 1.0000000
charge: -0.103822 -0.456231 0.114629 -0.047437 -0.369357 0.457112 0.180724 -0.249758 -0.229732 -0.366781 -0.358967 -0.352869 -0.144636 -0.008496 0.103682 -0.156052 -0.166047 0.195374 -0.190596 -0.184680 0.130763 0.112674 0.118807 0.175111 0.159779 0.105713 0.103438 0.100402 0.100177 0.093463 0.099641 0.101857 0.099594 0.100706 0.115952 0.117507 0.237581 0.215345 0.140920 0.168563 0.201123 0.142382 0.140218 0.252224
qa: -0.1038 -0.4562 0.1146 -0.0474 -0.3694 0.4571 0.1807 -0.2498 -0.2297 -0.3668 -0.3590 -0.3529 -0.1446 -0.0085 0.1037 -0.1561 -0.1660 0.1954 -0.1906 -0.1847 0.1308 0.1127 0.1188 0.1751 0.1598 0.1057 0.1034 0.1004 0.1002 0.0935 0.0996 0.1019 0.0996 0.1007 0.1160 0.1175 0.2376 0.2153 0.1409 0.1686 0.2011 0.1424 0.1402 0.2522
va: 1.2001 1.9648 3.3387 3.4538 3.0132 3.6446 3.7473 4.0057 3.8685 3.9268 3.9479 3.9279 3.8298 3.5446 4.0141 3.8735 3.8546 3.9508 3.9542 4.0270 3.7551 1.0119 0.9991 0.9943 0.9759 1.0072 0.9957 1.0075 1.0021 1.0135 1.0064 1.0059 1.0009 1.0070 0.9980 0.9917 1.0035 0.9699 1.0049 0.9840 0.9745 1.0080 1.0093 1.0055
dispersion: -0.028365773 hartree
energy: -1323.202760221458 hartree
dipole: 41.52074 -37.95179 3.56894 11.74305 -13.20363 -1.46059 -0.94466 -0.80412 -1.74878
magnitude: 4.23425 au
magnitude: 10.76262 debye
