program: Orca
programVersion: 5.0.2
elementType: Cl O N N N C C C C C C C C C C C C C C C C H H H H H H H H H H H H H H H H H H H H H H H
charge: 1
multiplicity: 1
keywords: wb97x-d3
keywords: def2-TZVPP
keywords: def2/J RIJCOSX
keywords: DEFGRID2
keywords: scfconv7
keywords: smallprint printgap noloewdin
keywords: NOSOSCF
formula: C16H23ClN3O
InChI: InChI=1/C16H23ClN3O/c1-15(2,3)16(21,10-20-12-18-11-19-20)9-8-13-4-6-14(17)7-5-13/h4-7,11-12,19,21H,8-10H2,1-3H3
44 atoms
Cl -4.906751 0.426163 1.360243
O  2.747986 -0.507811 -1.380959
N  0.472679 -1.449333 -0.082288
N  0.643574 -2.05199 -1.26229
N  -1.28426 -2.693102 -0.480848
C  2.359659 0.256797 -0.24484
C  3.636353 0.641555 0.598157
C  1.616456 1.523138 -0.69913
C  1.507936 -0.691012 0.619025
C  4.584235 -0.55508 0.746674
C  4.429571 1.757221 -0.093718
C  3.251659 1.126837 2.000732
C  0.318573 1.385064 -1.495047
C  -0.95952 1.127235 -0.739579
C  -0.701606 -1.86071 0.369185
C  -1.167203 1.569273 0.564723
C  -2.010698 0.473968 -1.380538
C  -0.432761 -2.778509 -1.490556
C  -2.372934 1.354897 1.217359
C  -3.22502 0.255987 -0.748727
C  -3.39528 0.697306 0.553446
H  2.305037 2.070347 -1.345649
H  1.460579 2.175468 0.160768
H  2.13872 -1.430163 1.110702
H  0.980246 -0.138978 1.391909
H  4.994291 -0.880882 -0.208653
H  4.125787 -1.420297 1.22748
H  5.42762 -0.261892 1.373956
H  3.919012 2.719579 -0.065931
H  4.657242 1.523993 -1.136202
H  5.383837 1.889216 0.418866
H  4.13839 1.511103 2.507327
H  2.517593 1.933691 1.980505
H  2.853929 0.327492 2.627822
H  0.429914 0.64113 -2.287074
H  0.186442 2.332548 -2.026223
H  3.073237 0.082258 -2.071278
H  -1.092651 -1.546399 1.323931
H  -0.383219 2.087145 1.10222
H  -1.877628 0.115625 -2.394677
H  -0.560333 -3.352155 -2.394009
H  -2.507729 1.702152 2.23296
H  -4.022385 -0.259808 -1.266466
H  1.468066 -1.810916 -1.819152
elementType: Cl O N C H
totalener: -1323.17190192 hartree
nucrepener: 1953.56500545 hartree
electener: -3276.73690737 hartree
oneelecener: -5665.36690200 hartree
twoeener: 2388.62999463 hartree
cpcmener: -0.11409621 hartree
kineticenergy: 1318.49477942 hartree
xcener: -106.553442648600 hartree
chargesum: 1.0000000
charge: -0.104294 -0.455702 0.108270 -0.034249 -0.364891 0.472190 0.207783 -0.233807 -0.242514 -0.350082 -0.359397 -0.370603 -0.150967 0.077001 0.123658 -0.203360 -0.235037 0.183440 -0.175529 -0.146570 0.119762 0.116561 0.101699 0.180057 0.155474 0.093083 0.096563 0.101278 0.100089 0.102525 0.101418 0.103744 0.107859 0.100027 0.099123 0.110340 0.239375 0.195775 0.145624 0.143227 0.199559 0.142976 0.143882 0.254639
qa: -0.1043 -0.4557 0.1083 -0.0342 -0.3649 0.4722 0.2078 -0.2338 -0.2425 -0.3501 -0.3594 -0.3706 -0.1510 0.0770 0.1237 -0.2034 -0.2350 0.1834 -0.1755 -0.1466 0.1198 0.1166 0.1017 0.1801 0.1555 0.0931 0.0966 0.1013 0.1001 0.1025 0.1014 0.1037 0.1079 0.1000 0.0991 0.1103 0.2394 0.1958 0.1456 0.1432 0.1996 0.1430 0.1439 0.2546
va: 1.2001 1.9702 3.3562 3.4358 3.0079 3.6071 3.7438 3.9562 3.8734 3.9254 3.9278 3.9466 3.9011 3.4925 4.0160 3.9166 3.9215 3.9624 4.0067 3.9495 3.7758 1.0015 1.0061 0.9912 0.9748 1.0181 1.0066 1.0022 0.9968 1.0073 1.0055 1.0037 1.0016 0.9983 1.0141 0.9959 1.0031 0.9805 1.0029 1.0026 0.9762 1.0071 1.0048 1.0093
dispersion: -0.028191718 hartree
energy: -1323.200093640304 hartree
dipole: 43.99317 -40.43101 3.56216 8.39806 -9.59137 -1.19331 -1.33102 -0.29905 -1.63006
magnitude: 4.09513 au
magnitude: 10.40899 debye
