program: Orca
programVersion: 5.0.2
elementType: Cl O N N N C C C C C C C C C C C C C C C C H H H H H H H H H H H H H H H H H H H H H H H
charge: 1
multiplicity: 1
keywords: wb97x-d3
keywords: def2-TZVPP
keywords: def2/J RIJCOSX
keywords: DEFGRID2
keywords: scfconv7
keywords: smallprint printgap noloewdin
keywords: NOSOSCF
formula: C16H23ClN3O
InChI: InChI=1/C16H23ClN3O/c1-15(2,3)16(21,10-20-12-18-11-19-20)9-8-13-4-6-14(17)7-5-13/h4-7,11-12,19,21H,8-10H2,1-3H3
44 atoms
Cl -4.863093 -0.322726 -0.751388
O  1.541638 0.173542 -1.250063
N  0.702327 -1.594222 0.724752
N  -0.182434 -1.688717 -0.273367
N  -1.144654 -2.461986 1.519691
C  2.210393 0.25359 -0.002209
C  3.72242 0.598888 -0.236301
C  1.531051 1.255826 0.976152
C  2.086963 -1.168044 0.560141
C  4.365469 -0.349951 -1.255127
C  3.843071 2.02468 -0.789508
C  4.531394 0.510944 1.061463
C  0.487852 2.210188 0.384212
C  -0.845931 1.580564 0.08328
C  0.089023 -2.070036 1.796583
C  -1.627751 1.0703 1.117656
C  -1.345142 1.49945 -1.213428
C  -1.289751 -2.197213 0.230769
C  -2.864233 0.492425 0.87333
C  -2.577327 0.920049 -1.481177
C  -3.328418 0.42031 -0.430547
H  2.295917 1.867725 1.451802
H  1.063584 0.716873 1.8046
H  2.575733 -1.903516 -0.07755
H  2.523619 -1.238129 1.553336
H  3.846291 -0.351822 -2.21348
H  4.422491 -1.380333 -0.900051
H  5.391601 -0.029359 -1.444634
H  4.896318 2.261376 -0.949572
H  3.446869 2.778592 -0.108092
H  3.348326 2.149157 -1.755197
H  5.560772 0.817141 0.866104
H  4.150539 1.161235 1.849747
H  4.575549 -0.504465 1.458758
H  0.873544 2.718236 -0.502838
H  0.334439 2.999847 1.123686
H  1.512589 1.037382 -1.676261
H  0.578552 -2.132002 2.755735
H  -1.270053 1.121819 2.139484
H  -0.765559 1.896116 -2.038443
H  -2.167259 -2.378004 -0.368127
H  -3.45371 0.100819 1.69139
H  -2.942052 0.862454 -2.498009
H  0.019921 -1.285857 -1.185983
elementType: Cl O N C H
totalener: -1323.17493531 hartree
nucrepener: 1970.82836639 hartree
electener: -3294.00330170 hartree
oneelecener: -5699.62450847 hartree
twoeener: 2405.62120677 hartree
cpcmener: -0.11229131 hartree
kineticenergy: 1318.48527505 hartree
xcener: -106.549105573779 hartree
chargesum: 1.0000000
charge: -0.106417 -0.448765 0.068814 -0.006435 -0.362639 0.397518 0.205464 -0.241641 -0.162164 -0.363613 -0.362169 -0.364527 -0.083705 0.071910 0.165939 -0.256092 -0.230119 0.156312 -0.122301 -0.109309 0.060113 0.113698 0.099577 0.168513 0.134907 0.097625 0.097617 0.102207 0.104793 0.102128 0.099622 0.101341 0.106324 0.100132 0.101310 0.108801 0.231782 0.189708 0.142840 0.143472 0.206218 0.144487 0.142530 0.254192
qa: -0.1064 -0.4488 0.0688 -0.0064 -0.3626 0.3975 0.2055 -0.2416 -0.1622 -0.3636 -0.3622 -0.3645 -0.0837 0.0719 0.1659 -0.2561 -0.2301 0.1563 -0.1223 -0.1093 0.0601 0.1137 0.0996 0.1685 0.1349 0.0976 0.0976 0.1022 0.1048 0.1021 0.0996 0.1013 0.1063 0.1001 0.1013 0.1088 0.2318 0.1897 0.1428 0.1435 0.2062 0.1445 0.1425 0.2542
va: 1.1964 1.9579 3.4242 3.4516 3.0077 3.6645 3.8134 3.8757 3.8591 3.9236 3.9228 3.9340 3.8030 3.5004 3.9995 3.9062 3.9468 3.9735 3.8744 3.9575 3.7750 1.0082 1.0080 0.9849 0.9942 1.0205 1.0015 1.0029 1.0071 1.0015 1.0072 1.0036 1.0054 0.9998 1.0080 1.0029 1.0168 0.9851 1.0044 1.0034 0.9729 1.0087 1.0052 0.9906
dispersion: -0.029047410 hartree
energy: -1323.203982723906 hartree
dipole: 45.32580 -42.19768 3.12812 10.53609 -11.57229 -1.03621 1.78067 -1.42599 0.35468
magnitude: 3.31431 au
magnitude: 8.42430 debye
