program: Orca
programVersion: 5.0.2
elementType: Cl O N N N C C C C C C C C C C C C C C C C H H H H H H H H H H H H H H H H H H H H H H H
charge: 1
multiplicity: 1
keywords: wb97x-d3
keywords: def2-TZVPP
keywords: def2/J RIJCOSX
keywords: DEFGRID2
keywords: scfconv7
keywords: smallprint printgap noloewdin
keywords: NOSOSCF
formula: C16H23ClN3O
InChI: InChI=1/C16H23ClN3O/c1-15(2,3)16(21,10-20-12-18-11-19-20)9-8-13-4-6-14(17)7-5-13/h4-7,11-12,19,21H,8-10H2,1-3H3
44 atoms
Cl -4.641468 1.509253 -1.933342
O  1.057324 -0.106465 -0.987957
N  1.152784 -2.094633 0.969763
N  0.103014 -2.356194 0.185829
N  -0.21629 -3.406623 2.064708
C  2.010941 0.083178 0.045609
C  3.324574 0.706543 -0.562615
C  1.48173 0.976138 1.185325
C  2.32178 -1.339711 0.534683
C  3.986735 -0.245236 -1.567725
C  2.987276 1.995174 -1.324298
C  4.350101 1.038948 0.524974
C  0.073415 0.762574 1.752574
C  -1.089423 0.955312 0.814312
C  0.936344 -2.753544 2.095883
C  -2.161477 0.067761 0.836734
C  -1.160087 2.040652 -0.058946
C  -0.714217 -3.133118 0.869647
C  -3.259241 0.230448 0.004747
C  -2.245302 2.217395 -0.903978
C  -3.286273 1.303083 -0.87019
H  1.55235 2.018784 0.871129
H  2.173957 0.884666 2.023578
H  2.787969 -1.932199 -0.250018
H  2.993043 -1.32584 1.390056
H  4.77238 0.289041 -2.104067
H  3.284194 -0.619124 -2.313556
H  4.466299 -1.102179 -1.092666
H  2.350406 1.81191 -2.191075
H  3.910731 2.437839 -1.700874
H  2.504901 2.752105 -0.70529
H  5.278802 1.37119 0.057566
H  4.019307 1.842069 1.183622
H  4.598184 0.176158 1.145919
H  -0.025709 1.496298 2.558704
H  -0.023344 -0.20221 2.249796
H  0.628526 0.729906 -1.200652
H  1.638395 -2.737289 2.914289
H  -2.149063 -0.768166 1.526107
H  -0.357194 2.768044 -0.092434
H  -1.656051 -3.475408 0.472959
H  -4.077617 -0.476137 0.040127
H  -2.275163 3.06093 -1.58047
H  -0.005018 -1.879905 -0.70734
elementType: Cl O N C H
totalener: -1323.17315100 hartree
nucrepener: 1929.09747243 hartree
electener: -3252.27062343 hartree
oneelecener: -5616.34231795 hartree
twoeener: 2364.07169452 hartree
cpcmener: -0.11554513 hartree
kineticenergy: 1318.49023623 hartree
xcener: -106.549194294574 hartree
chargesum: 1.0000000
charge: -0.105482 -0.478299 0.074463 -0.022784 -0.366716 0.428016 0.217134 -0.249725 -0.159451 -0.372110 -0.373716 -0.363199 -0.112791 0.047205 0.163548 -0.223547 -0.278561 0.177210 -0.135789 -0.129820 0.081615 0.132598 0.106722 0.179309 0.125435 0.101207 0.101631 0.097814 0.098698 0.103286 0.105394 0.101989 0.099452 0.103633 0.110750 0.095903 0.248262 0.191495 0.162171 0.163471 0.207494 0.143853 0.145404 0.256829
qa: -0.1055 -0.4783 0.0745 -0.0228 -0.3667 0.4280 0.2171 -0.2497 -0.1595 -0.3721 -0.3737 -0.3632 -0.1128 0.0472 0.1635 -0.2235 -0.2786 0.1772 -0.1358 -0.1298 0.0816 0.1326 0.1067 0.1793 0.1254 0.1012 0.1016 0.0978 0.0987 0.1033 0.1054 0.1020 0.0995 0.1036 0.1108 0.0959 0.2483 0.1915 0.1622 0.1635 0.2075 0.1439 0.1454 0.2568
va: 1.1987 1.9434 3.4317 3.4385 3.0190 3.6622 3.7423 3.9166 3.8729 3.9154 3.9213 3.9513 3.8789 3.5232 3.9942 3.9682 3.9799 3.9460 4.0000 3.9873 3.8243 0.9909 1.0087 0.9773 1.0037 1.0038 1.0209 0.9973 1.0098 1.0046 1.0028 1.0034 0.9993 1.0015 0.9992 1.0009 1.0120 0.9832 0.9907 0.9931 0.9730 1.0062 1.0048 0.9893
dispersion: -0.027169469 hartree
energy: -1323.200320471386 hartree
dipole: 40.76118 -37.63120 3.12998 4.09496 -6.54008 -2.44512 4.68779 -3.28835 1.39944
magnitude: 4.21115 au
magnitude: 10.70390 debye
