program: Orca
programVersion: 5.0.2
elementType: Cl O N N N C C C C C C C C C C C C C C C C H H H H H H H H H H H H H H H H H H H H H H H
charge: 1
multiplicity: 1
keywords: wb97x-d3
keywords: def2-TZVPP
keywords: def2/J RIJCOSX
keywords: DEFGRID2
keywords: scfconv7
keywords: smallprint printgap noloewdin
keywords: NOSOSCF
formula: C16H23ClN3O
InChI: InChI=1/C16H23ClN3O/c1-15(2,3)16(21,10-20-12-18-11-19-20)9-8-13-4-6-14(17)7-5-13/h4-7,11-12,19,21H,8-10H2,1-3H3
44 atoms
Cl -4.472395 2.244579 -1.915371
O  0.863909 -0.241296 -0.949703
N  1.356843 -2.382059 0.841697
N  0.240254 -2.724594 0.192906
N  0.227282 -3.769531 2.102796
C  1.867922 -0.071659 0.036171
C  3.053339 0.786007 -0.541672
C  1.326418 0.563848 1.338551
C  2.372211 -1.496554 0.28645
C  3.774992 0.054974 -1.681332
C  2.50795 2.09885 -1.115984
C  4.084349 1.121518 0.540801
C  -0.119386 0.288177 1.76985
C  -1.199093 0.782982 0.844276
C  1.323795 -3.032249 1.991844
C  -2.232785 -0.06018 0.444887
C  -1.214363 2.098439 0.382252
C  -0.430592 -3.548624 0.976524
C  -3.244319 0.378882 -0.396571
C  -2.212007 2.554721 -0.466806
C  -3.220923 1.686348 -0.851876
H  1.440845 1.646685 1.279689
H  1.977807 0.257283 2.160309
H  2.719397 -1.963244 -0.63359
H  3.189935 -1.510889 1.001936
H  4.37732 -0.784879 -1.331158
H  4.461505 0.744746 -2.175665
H  3.085712 -0.31499 -2.442274
H  1.931499 2.679437 -0.394013
H  1.882375 1.939092 -1.995764
H  3.342112 2.725977 -1.434346
H  4.492403 0.233162 1.026179
H  4.925066 1.650187 0.088087
H  3.680899 1.770902 1.317679
H  -0.238887 0.796855 2.730841
H  -0.296617 -0.763302 1.991647
H  0.387072 0.586583 -1.085858
H  2.118229 -2.950362 2.716523
H  -2.254307 -1.085441 0.794911
H  -0.434852 2.789242 0.68024
H  -1.382973 -3.964817 0.690921
H  -4.035131 -0.296697 -0.693661
H  -2.198727 3.577366 -0.81874
H  -0.010865 -2.282972 -0.688785
elementType: Cl O N C H
totalener: -1323.17497278 hartree
nucrepener: 1921.68708427 hartree
electener: -3244.86205706 hartree
oneelecener: -5601.75127124 hartree
twoeener: 2356.88921419 hartree
cpcmener: -0.11811073 hartree
kineticenergy: 1318.47926084 hartree
xcener: -106.546032714758 hartree
chargesum: 1.0000000
charge: -0.105340 -0.463093 0.080388 -0.031042 -0.364997 0.398531 0.220668 -0.242795 -0.164126 -0.368564 -0.378793 -0.356760 -0.109774 0.063650 0.171372 -0.209810 -0.279832 0.185853 -0.140211 -0.127739 0.084566 0.123471 0.113537 0.169390 0.130566 0.098562 0.102062 0.099162 0.105706 0.100315 0.104526 0.102925 0.101760 0.099162 0.112586 0.087084 0.244465 0.190720 0.153127 0.150596 0.205659 0.143046 0.144148 0.255271
qa: -0.1053 -0.4631 0.0804 -0.0310 -0.3650 0.3985 0.2207 -0.2428 -0.1641 -0.3686 -0.3788 -0.3568 -0.1098 0.0637 0.1714 -0.2098 -0.2798 0.1859 -0.1402 -0.1277 0.0846 0.1235 0.1135 0.1694 0.1306 0.0986 0.1021 0.0992 0.1057 0.1003 0.1045 0.1029 0.1018 0.0992 0.1126 0.0871 0.2445 0.1907 0.1531 0.1506 0.2057 0.1430 0.1441 0.2553
va: 1.1990 1.9590 3.4255 3.4639 3.0292 3.6854 3.7584 3.8988 3.8628 3.9142 3.9272 3.9420 3.8532 3.5188 3.9843 3.9664 3.9982 3.9541 3.9969 3.9667 3.8200 0.9989 1.0049 0.9848 1.0006 0.9965 1.0040 1.0212 1.0022 1.0084 1.0064 1.0037 1.0039 1.0013 1.0017 1.0045 1.0126 0.9838 0.9940 0.9985 0.9737 1.0062 1.0052 0.9838
dispersion: -0.027014722 hartree
energy: -1323.201987505172 hartree
dipole: 37.68921 -34.51737 3.17184 1.58882 -4.86508 -3.27626 4.76826 -3.50126 1.26700
magnitude: 4.73284 au
magnitude: 12.02992 debye
