program: Orca
programVersion: 5.0.2
elementType: Cl O N N N C C C C C C C C C C C C C C C C H H H H H H H H H H H H H H H H H H H H H H H
charge: 1
multiplicity: 1
keywords: wb97x-d3
keywords: def2-TZVPP
keywords: def2/J RIJCOSX
keywords: DEFGRID2
keywords: scfconv7
keywords: smallprint printgap noloewdin
keywords: NOSOSCF
formula: C16H23ClN3O
InChI: InChI=1/C16H23ClN3O/c1-15(2,3)16(21,10-20-12-18-11-19-20)9-8-13-4-6-14(17)7-5-13/h4-7,11-12,19,21H,8-10H2,1-3H3
44 atoms
Cl -4.68431 2.661379 -1.943043
O  0.346275 -0.533913 -0.264913
N  1.741771 -2.605099 0.91612
N  0.771361 -3.139943 0.169896
N  2.309582 -4.660734 0.418331
C  1.435319 -0.106066 0.533031
C  2.6624 0.256524 -0.367033
C  1.041505 1.081719 1.439517
C  1.688688 -1.270489 1.505538
C  3.241889 -0.964382 -1.08992
C  2.234118 1.261206 -1.445999
C  3.783251 0.887547 0.464332
C  -0.392121 1.062236 1.976625
C  -1.453875 1.44792 0.981591
C  2.653273 -3.551774 1.05667
C  -1.40884 2.680215 0.332545
C  -2.522217 0.600767 0.700187
C  1.139855 -4.370521 -0.128238
C  -2.392392 3.060185 -0.568074
C  -3.518745 0.962668 -0.194512
C  -3.443779 2.19429 -0.823498
H  1.204422 2.025384 0.917619
H  1.72627 1.105235 2.290753
H  2.6351 -1.145526 2.025488
H  0.904606 -1.301469 2.26244
H  3.956307 -0.625946 -1.843053
H  2.485066 -1.549944 -1.614362
H  3.795628 -1.624133 -0.421366
H  1.582375 0.813326 -2.198347
H  3.118083 1.618624 -1.976094
H  1.728625 2.140216 -1.043172
H  3.5036 1.856348 0.878036
H  4.102597 0.248731 1.290234
H  4.657558 1.04914 -0.168454
H  -0.428281 1.773266 2.806187
H  -0.640605 0.092249 2.412475
H  0.038694 0.186175 -0.827192
H  3.550272 -3.399984 1.63542
H  -0.596975 3.368921 0.53309
H  -2.582401 -0.364608 1.18784
H  0.535721 -5.019231 -0.741157
H  -2.337941 4.023068 -1.057781
H  -4.338622 0.286922 -0.397294
H  -0.013177 -2.571728 -0.14143
elementType: Cl O N C H
totalener: -1323.17412675 hartree
nucrepener: 1885.00070627 hartree
electener: -3208.17483302 hartree
oneelecener: -5529.04566397 hartree
twoeener: 2320.87083095 hartree
cpcmener: -0.11581966 hartree
kineticenergy: 1318.49848527 hartree
xcener: -106.548950121615 hartree
chargesum: 1.0000000
charge: -0.106985 -0.457263 0.074503 -0.021237 -0.369621 0.410838 0.257328 -0.239907 -0.208516 -0.380416 -0.373682 -0.367575 -0.087338 0.048361 0.169808 -0.258667 -0.210308 0.188774 -0.132623 -0.141053 0.080498 0.112367 0.111024 0.140538 0.175458 0.108265 0.101653 0.096903 0.101093 0.101760 0.109080 0.101441 0.104624 0.102688 0.107954 0.090616 0.232774 0.198369 0.146373 0.141461 0.201646 0.143532 0.143756 0.251705
qa: -0.1070 -0.4573 0.0745 -0.0212 -0.3696 0.4108 0.2573 -0.2399 -0.2085 -0.3804 -0.3737 -0.3676 -0.0873 0.0484 0.1698 -0.2587 -0.2103 0.1888 -0.1326 -0.1411 0.0805 0.1124 0.1110 0.1405 0.1755 0.1083 0.1017 0.0969 0.1011 0.1018 0.1091 0.1014 0.1046 0.1027 0.1080 0.0906 0.2328 0.1984 0.1464 0.1415 0.2016 0.1435 0.1438 0.2517
va: 1.1979 1.9444 3.4126 3.4650 3.0459 3.6720 3.7082 3.9373 3.8924 3.9333 3.9263 3.9481 3.8420 3.5243 3.9769 3.9824 3.9711 3.9537 3.9582 3.9761 3.8183 1.0018 1.0022 0.9949 0.9838 1.0051 1.0166 0.9986 1.0052 1.0053 1.0023 0.9996 1.0013 1.0033 1.0004 1.0139 1.0152 0.9803 1.0021 1.0035 0.9744 1.0050 1.0046 0.9931
dispersion: -0.025577982 hartree
energy: -1323.199704733088 hartree
dipole: 33.60669 -30.35496 3.25174 -1.22461 -2.17013 -3.39474 7.64802 -5.78986 1.85815
magnitude: 5.05478 au
magnitude: 12.84822 debye
