program: Orca
programVersion: 5.0.2
elementType: Cl O N N N C C C C C C C C C C C C C C C C H H H H H H H H H H H H H H H H H H H H H H H
charge: 1
multiplicity: 1
keywords: wb97x-d3
keywords: def2-TZVPP
keywords: def2/J RIJCOSX
keywords: DEFGRID2
keywords: scfconv7
keywords: smallprint printgap noloewdin
keywords: NOSOSCF
formula: C16H23ClN3O
InChI: InChI=1/C16H23ClN3O/c1-15(2,3)16(21,10-20-12-18-11-19-20)9-8-13-4-6-14(17)7-5-13/h4-7,11-12,19,21H,8-10H2,1-3H3
44 atoms
Cl -4.765591 2.38271 -2.028779
O  0.284997 -0.621628 -0.14684
N  1.818153 -2.461039 1.221643
N  0.771045 -3.109861 0.704771
N  2.338732 -4.580832 1.048591
C  1.455168 -0.068087 0.42621
C  2.563724 0.111993 -0.663411
C  1.160425 1.267774 1.146528
C  1.82971 -1.04138 1.558028
C  3.066672 -1.226892 -1.21516
C  1.996442 0.907475 -1.848091
C  3.76758 0.873743 -0.102291
C  -0.219011 1.378539 1.802837
C  -1.355983 1.623139 0.845838
C  2.746566 -3.379246 1.427898
C  -2.449021 0.763175 0.786076
C  -1.349104 2.729842 -0.001505
C  1.110976 -4.379696 0.597663
C  -3.502483 0.988444 -0.088125
C  -2.39012 2.972146 -0.884864
C  -3.460139 2.092574 -0.923285
H  1.28622 2.104576 0.458434
H  1.921224 1.416849 1.916588
H  2.830849 -0.842714 1.932059
H  1.141283 -0.915973 2.394287
H  3.682103 -1.040863 -2.097422
H  2.258911 -1.889841 -1.52995
H  3.70268 -1.76047 -0.508211
H  1.258585 0.338995 -2.417644
H  2.80408 1.147894 -2.540919
H  1.537912 1.853228 -1.554066
H  3.525665 1.902603 0.164011
H  4.197748 0.391114 0.777334
H  4.554116 0.914572 -0.85788
H  -0.172466 2.217592 2.501825
H  -0.440506 0.500147 2.41323
H  -0.104783 -0.005652 -0.777806
H  3.704952 -3.137841 1.859257
H  -2.484201 -0.104922 1.433035
H  -0.519754 3.426661 0.02334
H  0.445725 -5.122358 0.188064
H  -4.340334 0.304867 -0.117479
H  -2.363354 3.838481 -1.532038
H  -0.046674 -2.598921 0.379641
elementType: Cl O N C H
totalener: -1323.17431153 hartree
nucrepener: 1886.25270267 hartree
electener: -3209.42701421 hartree
oneelecener: -5531.54894746 hartree
twoeener: 2322.12193325 hartree
cpcmener: -0.11549857 hartree
kineticenergy: 1318.49306295 hartree
xcener: -106.547891017675 hartree
chargesum: 1.0000000
charge: -0.106844 -0.457853 0.073978 -0.022847 -0.369962 0.403762 0.261813 -0.233517 -0.205237 -0.381934 -0.374366 -0.365709 -0.091764 0.047958 0.169068 -0.206516 -0.262398 0.188385 -0.140998 -0.130968 0.080663 0.111414 0.110317 0.139622 0.174841 0.108514 0.101851 0.097269 0.100819 0.101790 0.108630 0.100591 0.103917 0.102598 0.108000 0.090536 0.232895 0.200114 0.141962 0.146495 0.202873 0.143409 0.144783 0.252046
qa: -0.1068 -0.4579 0.0740 -0.0228 -0.3700 0.4038 0.2618 -0.2335 -0.2052 -0.3819 -0.3744 -0.3657 -0.0918 0.0480 0.1691 -0.2065 -0.2624 0.1884 -0.1410 -0.1310 0.0807 0.1114 0.1103 0.1396 0.1748 0.1085 0.1019 0.0973 0.1008 0.1018 0.1086 0.1006 0.1039 0.1026 0.1080 0.0905 0.2329 0.2001 0.1420 0.1465 0.2029 0.1434 0.1448 0.2520
va: 1.1976 1.9438 3.4126 3.4647 3.0460 3.6729 3.7091 3.9282 3.8960 3.9321 3.9256 3.9465 3.8497 3.5260 3.9762 3.9641 3.9803 3.9526 3.9758 3.9540 3.8181 1.0020 1.0024 0.9952 0.9830 1.0053 1.0164 0.9988 1.0052 1.0061 1.0025 0.9997 1.0014 1.0032 1.0009 1.0141 1.0154 0.9795 1.0035 1.0018 0.9740 1.0046 1.0042 0.9930
dispersion: -0.025641764 hartree
energy: -1323.199953297746 hartree
dipole: 33.51590 -30.16628 3.34962 -0.68526 -2.42757 -3.11283 4.80596 -2.59651 2.20945
magnitude: 5.07852 au
magnitude: 12.90856 debye
