program: Orca
programVersion: 5.0.2
elementType: Cl O N N N C C C C C C C C C C C C C C C C H H H H H H H H H H H H H H H H H H H H H H H
charge: 1
multiplicity: 1
keywords: wb97x-d3
keywords: def2-TZVPP
keywords: def2/J RIJCOSX
keywords: DEFGRID2
keywords: scfconv7
keywords: smallprint printgap noloewdin
keywords: NOSOSCF
formula: C16H23ClN3O
InChI: InChI=1/C16H23ClN3O/c1-15(2,3)16(21,10-20-12-18-11-19-20)9-8-13-4-6-14(17)7-5-13/h4-7,11-12,19,21H,8-10H2,1-3H3
44 atoms
Cl -5.129912 3.245269 0.434793
O  2.375508 -0.489088 -1.508484
N  1.60464 -2.653683 0.078382
N  1.505481 -2.999394 -1.207598
N  0.249789 -4.366422 -0.070886
C  2.250071 -0.221954 -0.11821
C  3.407253 0.748218 0.334553
C  0.871894 0.390741 0.184112
C  2.455732 -1.57907 0.577479
C  4.779791 0.212455 -0.095362
C  3.234738 2.124998 -0.32081
C  3.428487 0.939864 1.854093
C  -0.379158 -0.391926 -0.239364
C  -1.593263 0.482057 -0.091491
C  0.841045 -3.504449 0.742909
C  -1.982712 1.346596 -1.111197
C  -2.325505 0.487444 1.092135
C  0.673298 -4.020274 -1.275667
C  -3.06835 2.196158 -0.960615
C  -3.415119 1.329134 1.263359
C  -3.774152 2.181694 0.232295
H  0.827245 1.359399 -0.318993
H  0.799875 0.60187 1.252252
H  3.482873 -1.923891 0.474296
H  2.23009 -1.510493 1.638309
H  4.845373 0.044688 -1.169978
H  5.059249 -0.713255 0.409298
H  5.544729 0.945756 0.164328
H  3.149209 2.065098 -1.40745
H  4.112007 2.736397 -0.104098
H  2.369928 2.669983 0.056677
H  4.22468 1.637676 2.119171
H  2.497837 1.357249 2.239159
H  3.630642 0.013327 2.393903
H  -0.520701 -1.275958 0.3817
H  -0.298224 -0.72235 -1.277127
H  1.927199 0.201082 -2.010689
H  0.740678 -3.466669 1.815842
H  -1.431413 1.359896 -2.043855
H  -2.044441 -0.179076 1.898735
H  0.401795 -4.482034 -2.210973
H  -3.357809 2.859042 -1.764864
H  -3.973467 1.316405 2.18961
H  1.933944 -2.41427 -1.923906
elementType: Cl O N C H
totalener: -1323.17564696 hartree
nucrepener: 1850.56632269 hartree
electener: -3173.74196965 hartree
oneelecener: -5460.16666070 hartree
twoeener: 2286.42469105 hartree
cpcmener: -0.12130917 hartree
kineticenergy: 1318.49076140 hartree
xcener: -106.545991980175 hartree
chargesum: 1.0000000
charge: -0.106097 -0.464773 0.070147 -0.025559 -0.368021 0.436279 0.224802 -0.327924 -0.158095 -0.355381 -0.375912 -0.372458 -0.004957 0.009494 0.157397 -0.231388 -0.210981 0.187771 -0.153794 -0.160966 0.096344 0.131197 0.111711 0.179713 0.132045 0.097132 0.097687 0.101240 0.105504 0.103240 0.101061 0.103536 0.103742 0.100584 0.090685 0.107049 0.241703 0.194720 0.144505 0.142445 0.202733 0.143548 0.143039 0.255252
qa: -0.1061 -0.4648 0.0701 -0.0256 -0.3680 0.4363 0.2248 -0.3279 -0.1581 -0.3554 -0.3759 -0.3725 -0.0050 0.0095 0.1574 -0.2314 -0.2110 0.1878 -0.1538 -0.1610 0.0963 0.1312 0.1117 0.1797 0.1320 0.0971 0.0977 0.1012 0.1055 0.1032 0.1011 0.1035 0.1037 0.1006 0.0907 0.1070 0.2417 0.1947 0.1445 0.1424 0.2027 0.1435 0.1430 0.2553
va: 1.1988 1.9603 3.4326 3.4495 3.0384 3.6805 3.7401 3.9300 3.8679 3.9083 3.9235 3.9482 3.7089 3.6287 3.9881 3.9831 3.9726 3.9546 3.9804 3.9941 3.8118 0.9878 1.0097 0.9805 0.9909 1.0218 1.0034 1.0033 1.0094 1.0052 0.9978 1.0021 1.0026 0.9999 1.0136 1.0245 1.0004 0.9827 1.0040 1.0033 0.9745 1.0055 1.0060 0.9963
dispersion: -0.024153976 hartree
energy: -1323.199800938954 hartree
dipole: 40.55702 -36.31504 4.24197 -2.22793 -1.64035 -3.86829 1.87550 -2.78206 -0.90656
magnitude: 5.81204 au
magnitude: 14.77304 debye
