program: Orca
programVersion: 5.0.2
elementType: Cl O N N N C C C C C C C C C C C C C C C C H H H H H H H H H H H H H H H H H H H H H H H
charge: 1
multiplicity: 1
keywords: wb97x-d3
keywords: def2-TZVPP
keywords: def2/J RIJCOSX
keywords: DEFGRID2
keywords: scfconv7
keywords: smallprint printgap noloewdin
keywords: NOSOSCF
formula: C16H23ClN3O
InChI: InChI=1/C16H23ClN3O/c1-15(2,3)16(21,10-20-12-18-11-19-20)9-8-13-4-6-14(17)7-5-13/h4-7,11-12,19,21H,8-10H2,1-3H3
44 atoms
Cl -5.504256 1.922377 -0.543134
O  2.68039 -0.910681 -1.572793
N  1.336089 -2.292505 0.539245
N  1.062087 -2.925685 -0.605354
N  -0.321211 -3.676888 0.898033
C  2.412336 -0.224633 -0.348015
C  3.577993 0.786356 -0.070882
C  1.010492 0.416528 -0.459317
C  2.43748 -1.346972 0.695443
C  4.89081 0.045669 0.215159
C  3.803091 1.670418 -1.302927
C  3.285304 1.704476 1.117447
C  0.252477 0.799651 0.820635
C  -1.188388 1.085359 0.50219
C  0.484909 -2.77005 1.431407
C  -2.134838 0.063973 0.503649
C  -1.605204 2.369152 0.163601
C  0.054884 -3.744282 -0.368368
C  -3.462109 0.309853 0.185991
C  -2.927314 2.635859 -0.16138
C  -3.846538 1.599479 -0.145985
H  0.381395 -0.284559 -1.01533
H  1.078099 1.300879 -1.098475
H  3.35955 -1.921595 0.623722
H  2.359687 -0.96897 1.711613
H  4.890687 -0.449876 1.187635
H  5.712081 0.764085 0.231925
H  5.127576 -0.698265 -0.546605
H  2.900705 2.197754 -1.616758
H  4.185408 1.110617 -2.157263
H  4.547876 2.431565 -1.065171
H  2.980297 1.162312 2.014028
H  4.18997 2.259847 1.371482
H  2.51777 2.442516 0.886955
H  0.692174 1.67711 1.289041
H  0.293665 0.00324 1.564732
H  2.430607 -0.34474 -2.312884
H  0.487409 -2.444921 2.459451
H  -1.834966 -0.944938 0.762686
H  -0.888853 3.181963 0.157411
H  -0.374727 -4.367904 -1.135409
H  -4.183998 -0.495679 0.200453
H  -3.23343 3.640995 -0.418104
H  1.555017 -2.66874 -1.460058
elementType: Cl O N C H
totalener: -1323.17586379 hartree
nucrepener: 1870.84310327 hartree
electener: -3194.01896706 hartree
oneelecener: -5500.44062612 hartree
twoeener: 2306.42165906 hartree
cpcmener: -0.12130304 hartree
kineticenergy: 1318.48412609 hartree
xcener: -106.543551225751 hartree
chargesum: 1.0000000
charge: -0.106046 -0.450813 0.100655 -0.038862 -0.374986 0.427739 0.244527 -0.350666 -0.167008 -0.362258 -0.373816 -0.395401 -0.049939 0.012706 0.148321 -0.207478 -0.225464 0.193338 -0.159598 -0.147479 0.098545 0.122555 0.131544 0.165063 0.145464 0.099872 0.100237 0.099505 0.107595 0.098410 0.100988 0.107175 0.106052 0.103609 0.113148 0.101313 0.238120 0.198134 0.158589 0.145508 0.203224 0.140988 0.143688 0.253202
qa: -0.1060 -0.4508 0.1007 -0.0389 -0.3750 0.4277 0.2445 -0.3507 -0.1670 -0.3623 -0.3738 -0.3954 -0.0499 0.0127 0.1483 -0.2075 -0.2255 0.1933 -0.1596 -0.1475 0.0985 0.1226 0.1315 0.1651 0.1455 0.0999 0.1002 0.0995 0.1076 0.0984 0.1010 0.1072 0.1061 0.1036 0.1131 0.1013 0.2381 0.1981 0.1586 0.1455 0.2032 0.1410 0.1437 0.2532
va: 1.1982 1.9755 3.3690 3.4648 3.0093 3.6991 3.6897 3.9648 3.8342 3.9136 3.9358 3.9665 3.6482 3.6009 3.9752 3.9461 4.0036 3.9487 4.0208 3.9750 3.8002 1.0155 1.0068 0.9876 0.9921 0.9961 1.0048 1.0199 1.0020 1.0105 1.0019 0.9998 1.0072 0.9975 1.0149 1.0142 0.9998 0.9799 0.9955 1.0027 0.9733 1.0088 1.0053 0.9978
dispersion: -0.025112166 hartree
energy: -1323.200975953508 hartree
dipole: 44.12918 -40.00896 4.12023 3.50054 -6.68825 -3.18772 2.09623 -2.28765 -0.19142
magnitude: 5.21291 au
magnitude: 13.25017 debye
