program: Orca
programVersion: 5.0.2
elementType: Cl O N N N C C C C C C C C C C C C C C C C H H H H H H H H H H H H H H H H H H H H H H H
charge: 1
multiplicity: 1
keywords: wb97x-d3
keywords: def2-TZVPP
keywords: def2/J RIJCOSX
keywords: DEFGRID2
keywords: scfconv7
keywords: smallprint printgap noloewdin
keywords: NOSOSCF
formula: C16H23ClN3O
InChI: InChI=1/C16H23ClN3O/c1-15(2,3)16(21,10-20-12-18-11-19-20)9-8-13-4-6-14(17)7-5-13/h4-7,11-12,19,21H,8-10H2,1-3H3
44 atoms
Cl -5.517795 1.958806 -0.332082
O  2.727981 -0.695255 -1.594456
N  1.402954 -2.416089 0.21132
N  1.358528 -3.017639 -0.981197
N  -0.329717 -3.75358 0.178627
C  2.39722 -0.193037 -0.303505
C  3.509185 0.807198 0.17612
C  0.976718 0.396949 -0.405702
C  2.407298 -1.433977 0.598669
C  4.900846 0.280218 -0.200516
C  3.32695 2.165108 -0.508744
C  3.506238 1.018565 1.695533
C  0.288767 0.903524 0.864062
C  -1.164624 1.176329 0.595618
C  0.367151 -2.879651 0.889926
C  -1.600407 2.447555 0.235108
C  -2.105408 0.151077 0.659695
C  0.304406 -3.810684 -0.98099
C  -2.9347 2.698271 -0.05271
C  -3.443253 0.380628 0.378333
C  -3.846377 1.658132 0.021734
H  0.336271 -0.369134 -0.853636
H  0.996249 1.209628 -1.137415
H  3.377742 -1.929384 0.588265
H  2.171916 -1.187623 1.630315
H  5.657767 0.936477 0.232619
H  5.068229 0.265315 -1.276733
H  5.09579 -0.722592 0.183647
H  4.181555 2.804476 -0.280691
H  2.432996 2.689143 -0.168594
H  3.274439 2.078691 -1.596294
H  4.214066 1.810295 1.946714
H  2.538922 1.31791 2.093652
H  3.828558 0.128348 2.238037
H  0.764212 1.819498 1.214511
H  0.373227 0.171895 1.671182
H  2.53356 -0.0222 -2.257574
H  0.161436 -2.570822 1.902516
H  -0.889117 3.263003 0.1797
H  -1.793253 -0.848641 0.938222
H  0.033885 -4.412509 -1.833272
H  -3.254856 3.694089 -0.328127
H  -4.158969 -0.428267 0.439501
H  2.013796 -2.770692 -1.719125
elementType: Cl O N C H
totalener: -1323.17756794 hartree
nucrepener: 1866.60019705 hartree
electener: -3189.77776499 hartree
oneelecener: -5492.14058174 hartree
twoeener: 2302.36281675 hartree
cpcmener: -0.12261249 hartree
kineticenergy: 1318.48151866 hartree
xcener: -106.542839707032 hartree
chargesum: 1.0000000
charge: -0.106000 -0.456114 0.086996 -0.029021 -0.373315 0.447835 0.185425 -0.304383 -0.183132 -0.357767 -0.356317 -0.373916 -0.050076 0.005068 0.167799 -0.214781 -0.222746 0.188648 -0.155992 -0.160693 0.100670 0.117414 0.123266 0.172647 0.140632 0.100126 0.092848 0.099471 0.101717 0.101641 0.101546 0.103152 0.117439 0.101984 0.099176 0.115299 0.234615 0.195314 0.144882 0.160734 0.202908 0.143278 0.141938 0.249784
qa: -0.1060 -0.4561 0.0870 -0.0290 -0.3733 0.4478 0.1854 -0.3044 -0.1831 -0.3578 -0.3563 -0.3739 -0.0501 0.0051 0.1678 -0.2148 -0.2227 0.1886 -0.1560 -0.1607 0.1007 0.1174 0.1233 0.1726 0.1406 0.1001 0.0928 0.0995 0.1017 0.1016 0.1015 0.1032 0.1174 0.1020 0.0992 0.1153 0.2346 0.1953 0.1449 0.1607 0.2029 0.1433 0.1419 0.2498
va: 1.1984 1.9672 3.3766 3.4841 3.0188 3.7306 3.7510 3.9777 3.8271 3.9452 3.9271 3.9340 3.6776 3.5460 3.9677 3.9980 3.9669 3.9568 3.9859 4.0154 3.8022 1.0140 1.0032 0.9910 0.9870 1.0022 1.0158 1.0049 1.0064 0.9992 1.0075 1.0044 0.9991 0.9966 1.0150 1.0051 1.0064 0.9808 1.0028 0.9940 0.9742 1.0059 1.0080 0.9926
dispersion: -0.025099101 hartree
energy: -1323.202667040711 hartree
dipole: 43.73989 -39.31858 4.42131 3.42306 -6.85697 -3.43391 3.84227 -4.38871 -0.54644
magnitude: 5.62479 au
magnitude: 14.29709 debye
