program: Orca
programVersion: 5.0.2
elementType: Cl O N N N C C C C C C C C C C C C C C C C H H H H H H H H H H H H H H H H H H H H H H H
charge: 1
multiplicity: 1
keywords: wb97x-d3
keywords: def2-TZVPP
keywords: def2/J RIJCOSX
keywords: DEFGRID2
keywords: scfconv7
keywords: smallprint printgap noloewdin
keywords: NOSOSCF
formula: C16H23ClN3O
InChI: InChI=1/C16H23ClN3O/c1-15(2,3)16(21,10-20-12-18-11-19-20)9-8-13-4-6-14(17)7-5-13/h4-7,11-12,18,21H,8-10H2,1-3H3
44 atoms
Cl 4.669551 -1.71752 -1.505639
O  -1.183564 0.032338 -1.050128
N  -0.694886 2.011599 0.697717
N  -0.141709 2.376806 1.867576
N  1.118099 2.978797 0.205144
C  -2.097818 0.007756 0.022791
C  -3.567007 -0.197958 -0.511962
C  -1.725018 -1.091401 1.030049
C  -2.025525 1.413477 0.660089
C  -3.805467 -1.658379 -0.916197
C  -4.609127 0.172872 0.549893
C  -3.812314 0.661123 -1.75891
C  -0.37081 -1.018432 1.738661
C  0.865059 -1.17594 0.890438
C  0.056429 2.378461 -0.316519
C  0.956593 -2.143555 -0.109784
C  1.992526 -0.399533 1.141432
C  0.967855 2.961731 1.551096
C  2.116003 -2.314881 -0.848522
C  3.164237 -0.553438 0.412569
C  3.215209 -1.511514 -0.584316
H  -1.793654 -2.057417 0.525525
H  -2.489846 -1.120139 1.809046
H  -2.65518 2.12121 0.124656
H  -2.368266 1.388343 1.691206
H  -3.035975 -2.041871 -1.590721
H  -4.755902 -1.736963 -1.447252
H  -3.865198 -2.329652 -0.059206
H  -4.630655 1.241226 0.771421
H  -4.45985 -0.360831 1.489909
H  -5.605813 -0.08981 0.190346
H  -4.863878 0.590309 -2.042994
H  -3.60079 1.721768 -1.61102
H  -3.227746 0.324704 -2.615426
H  -0.372604 -1.832159 2.471244
H  -0.288536 -0.110454 2.337759
H  -1.122208 -0.845087 -1.444154
H  -0.151829 2.252459 -1.364491
H  0.114375 -2.790118 -0.324739
H  1.892967 3.37306 -0.316321
H  1.678743 3.377219 2.245333
H  2.159735 -3.071778 -1.620578
H  4.024627 0.065892 0.629317
H  1.971044 0.334887 1.937377
elementType: Cl O N C H
totalener: -1323.18606085 hartree
nucrepener: 1931.74813454 hartree
electener: -3254.93419539 hartree
oneelecener: -5623.72278252 hartree
twoeener: 2368.78858712 hartree
cpcmener: -0.10215061 hartree
kineticenergy: 1318.48754477 hartree
xcener: -106.545191936888 hartree
chargesum: 1.0000000
charge: -0.100494 -0.435110 0.146388 -0.298007 -0.084893 0.437385 0.192919 -0.242036 -0.221614 -0.358736 -0.361011 -0.342771 -0.128667 0.106215 0.188404 -0.279381 -0.262821 0.132342 -0.123447 -0.133433 0.074861 0.106331 0.102568 0.169918 0.144781 0.096759 0.104155 0.099746 0.096704 0.106361 0.102543 0.101684 0.093492 0.093027 0.110363 0.103384 0.220212 0.201898 0.150108 0.242587 0.200911 0.142286 0.143315 0.160777
qa: -0.1005 -0.4351 0.1464 -0.2980 -0.0849 0.4374 0.1929 -0.2420 -0.2216 -0.3587 -0.3610 -0.3428 -0.1287 0.1062 0.1884 -0.2794 -0.2628 0.1323 -0.1234 -0.1334 0.0749 0.1063 0.1026 0.1699 0.1448 0.0968 0.1042 0.0997 0.0967 0.1064 0.1025 0.1017 0.0935 0.0930 0.1104 0.1034 0.2202 0.2019 0.1501 0.2426 0.2009 0.1423 0.1433 0.1608
va: 1.2040 1.9860 3.4267 2.8655 3.5445 3.6533 3.7684 3.9256 3.8359 3.9288 3.9427 3.9367 3.8405 3.4942 3.9219 3.9972 3.9528 3.9373 3.9731 3.9865 3.8534 0.9918 1.0208 0.9874 1.0004 1.0091 1.0055 0.9968 1.0012 1.0036 1.0039 1.0039 1.0056 1.0143 0.9983 1.0075 1.0274 0.9941 0.9990 0.9691 0.9785 1.0056 1.0059 0.9930
dispersion: -0.026821990 hartree
energy: -1323.212882844819 hartree
dipole: -41.97692 40.94045 -1.03647 1.66834 2.33255 4.00089 3.31134 -2.93176 0.37957
magnitude: 4.15035 au
magnitude: 10.54936 debye
