program: Orca
programVersion: 5.0.2
elementType: Cl O N N N C C C C C C C C C C C C C C C C H H H H H H H H H H H H H H H H H H H H H H H
charge: 1
multiplicity: 1
keywords: wb97x-d3
keywords: def2-TZVPP
keywords: def2/J RIJCOSX
keywords: DEFGRID2
keywords: scfconv7
keywords: smallprint printgap noloewdin
keywords: NOSOSCF
formula: C16H23ClN3O
InChI: InChI=1/C16H23ClN3O/c1-15(2,3)16(21,10-20-12-18-11-19-20)9-8-13-4-6-14(17)7-5-13/h4-7,11-12,18,21H,8-10H2,1-3H3
44 atoms
Cl -4.924425 -0.615543 0.423742
O  1.545698 -0.368164 1.279403
N  0.450316 1.780195 -0.069367
N  -0.140167 2.159758 -1.219246
N  -1.607241 1.975668 0.375216
C  2.221467 0.043934 0.10807
C  3.769941 -0.131938 0.296551
C  1.709956 -0.699731 -1.162259
C  1.885905 1.538233 -0.001962
C  4.111376 -1.625122 0.381164
C  4.556078 0.481216 -0.866157
C  4.255859 0.527404 1.593204
C  0.803112 -1.917046 -0.944661
C  -0.622069 -1.594488 -0.580237
C  -0.431047 1.655602 0.897888
C  -1.460744 -0.99193 -1.516435
C  -1.15539 -1.902512 0.668412
C  -1.397193 2.266523 -0.929841
C  -2.782786 -0.694853 -1.222211
C  -2.47492 -1.611664 0.984986
C  -3.27781 -1.002998 0.034638
H  2.5631 -1.036849 -1.749344
H  1.187377 -0.007065 -1.825743
H  2.262931 2.099474 0.850719
H  2.304089 1.971856 -0.90534
H  5.186825 -1.743518 0.52324
H  3.847217 -2.173681 -0.523667
H  3.630535 -2.120712 1.227442
H  4.443844 1.565123 -0.920477
H  4.277477 0.067226 -1.836017
H  5.620285 0.281199 -0.729049
H  5.319971 0.323064 1.72379
H  4.14578 1.612905 1.585409
H  3.74343 0.143795 2.475186
H  1.232136 -2.609152 -0.216434
H  0.792816 -2.466004 -1.889437
H  1.684958 -1.309491 1.430986
H  -0.247616 1.394553 1.92568
H  -1.080592 -0.751927 -2.502464
H  -0.536502 -2.387522 1.413163
H  -2.175628 2.556102 -1.614804
H  -3.414122 -0.226375 -1.965366
H  -2.866713 -1.859545 1.962282
H  -2.49667 1.955502 0.861338
elementType: Cl O N C H
totalener: -1323.18290699 hartree
nucrepener: 1968.66361693 hartree
electener: -3291.84652391 hartree
oneelecener: -5696.58396857 hartree
twoeener: 2404.73744465 hartree
cpcmener: -0.10952769 hartree
kineticenergy: 1318.48668377 hartree
xcener: -106.545790454889 hartree
chargesum: 1.0000000
charge: -0.106620 -0.444321 0.137015 -0.296657 -0.084621 0.426498 0.198709 -0.276762 -0.193702 -0.361472 -0.362336 -0.363997 -0.087499 0.071523 0.174539 -0.246624 -0.203002 0.138031 -0.157304 -0.132496 0.077334 0.110421 0.105731 0.164117 0.140771 0.104089 0.102174 0.097607 0.098813 0.105278 0.101048 0.101585 0.096700 0.097380 0.101813 0.108083 0.230062 0.204893 0.144507 0.142503 0.202352 0.145953 0.142625 0.245258
qa: -0.1066 -0.4443 0.1370 -0.2967 -0.0846 0.4265 0.1987 -0.2768 -0.1937 -0.3615 -0.3623 -0.3640 -0.0875 0.0715 0.1745 -0.2466 -0.2030 0.1380 -0.1573 -0.1325 0.0773 0.1104 0.1057 0.1641 0.1408 0.1041 0.1022 0.0976 0.0988 0.1053 0.1010 0.1016 0.0967 0.0974 0.1018 0.1081 0.2301 0.2049 0.1445 0.1425 0.2024 0.1460 0.1426 0.2453
va: 1.1968 1.9813 3.4452 2.8794 3.5458 3.6517 3.8142 3.8820 3.8162 3.9224 3.9332 3.9245 3.8084 3.4680 3.9200 3.8965 3.9501 3.9455 3.9115 3.9691 3.7646 1.0118 1.0103 0.9888 1.0097 1.0073 1.0015 1.0073 0.9998 1.0052 1.0037 1.0031 1.0022 1.0206 1.0081 1.0034 1.0177 0.9922 1.0060 1.0033 0.9791 1.0051 1.0057 0.9663
dispersion: -0.028923046 hartree
energy: -1323.211830032139 hartree
dipole: 44.37650 -43.94449 0.43201 -2.42174 4.75134 2.32960 -0.87341 1.58802 0.71461
magnitude: 2.47474 au
magnitude: 6.29028 debye
