program: Orca
programVersion: 5.0.2
elementType: Cl O N N N C C C C C C C C C C C C C C C C H H H H H H H H H H H H H H H H H H H H H H H
charge: 1
multiplicity: 1
keywords: wb97x-d3
keywords: def2-TZVPP
keywords: def2/J RIJCOSX
keywords: DEFGRID2
keywords: scfconv7
keywords: smallprint printgap noloewdin
keywords: NOSOSCF
formula: C16H23ClN3O
InChI: InChI=1/C16H23ClN3O/c1-15(2,3)16(21,10-20-12-18-11-19-20)9-8-13-4-6-14(17)7-5-13/h4-7,11-12,18,21H,8-10H2,1-3H3
44 atoms
Cl -4.996188 -2.260693 -1.960807
O  2.555841 0.164409 1.861391
N  1.036516 2.326413 0.738989
N  -0.043475 2.433812 -0.055983
N  -0.526709 3.009677 1.986055
C  2.463278 0.302505 0.455382
C  3.794851 -0.167962 -0.228214
C  1.243947 -0.461593 -0.119169
C  2.302841 1.814271 0.239735
C  4.134076 -1.591778 0.229266
C  3.671248 -0.16768 -1.755394
C  4.971699 0.734161 0.160727
C  0.110507 -0.764316 0.870924
C  -1.162674 -1.15709 0.171158
C  0.755256 2.667018 1.975393
C  -1.184452 -2.166852 -0.790367
C  -2.359588 -0.510118 0.465295
C  -0.990215 2.848908 0.723338
C  -2.354992 -2.513421 -1.447138
C  -3.543386 -0.845083 -0.177408
C  -3.528233 -1.8434 -1.136124
H  1.573218 -1.416525 -0.528877
H  0.850348 0.091818 -0.974075
H  3.083174 2.366257 0.759845
H  2.348274 2.07774 -0.813361
H  4.399482 -1.637155 1.286977
H  4.999846 -1.953898 -0.32739
H  3.323756 -2.301603 0.05406
H  2.945536 -0.895519 -2.118644
H  4.634179 -0.431505 -2.196366
H  3.394219 0.807888 -2.158191
H  5.903935 0.285869 -0.187483
H  4.911707 1.72506 -0.292613
H  5.057621 0.860277 1.24097
H  -0.108128 0.07283 1.532443
H  0.421891 -1.580694 1.529397
H  2.513276 -0.769691 2.095519
H  1.431135 2.689979 2.813998
H  -0.275035 -2.699462 -1.040137
H  -2.375617 0.272904 1.21417
H  -2.002865 3.054856 0.421268
H  -2.348164 -3.29699 -2.192875
H  -4.461482 -0.328221 0.067566
H  -1.048308 3.335528 2.792125
elementType: Cl O N C H
totalener: -1323.18575615 hartree
nucrepener: 1877.54642948 hartree
electener: -3200.73218563 hartree
oneelecener: -5515.80527436 hartree
twoeener: 2315.07308874 hartree
cpcmener: -0.12290818 hartree
kineticenergy: 1318.48376896 hartree
xcener: -106.542187061805 hartree
chargesum: 1.0000000
charge: -0.106935 -0.446351 0.124750 -0.290398 -0.080984 0.479408 0.200380 -0.358995 -0.182397 -0.363059 -0.353510 -0.366482 -0.060842 0.042148 0.176435 -0.250031 -0.222528 0.135510 -0.142735 -0.146121 0.085106 0.114936 0.121646 0.149332 0.142255 0.096137 0.100414 0.109640 0.097784 0.102612 0.102686 0.101137 0.097695 0.098234 0.097086 0.111627 0.233068 0.213389 0.146539 0.154883 0.201902 0.143766 0.143933 0.246930
qa: -0.1069 -0.4464 0.1248 -0.2904 -0.0810 0.4794 0.2004 -0.3590 -0.1824 -0.3631 -0.3535 -0.3665 -0.0608 0.0421 0.1764 -0.2500 -0.2225 0.1355 -0.1427 -0.1461 0.0851 0.1149 0.1216 0.1493 0.1423 0.0961 0.1004 0.1096 0.0978 0.1026 0.1027 0.1011 0.0977 0.0982 0.0971 0.1116 0.2331 0.2134 0.1465 0.1549 0.2019 0.1438 0.1439 0.2469
va: 1.1972 1.9951 3.4566 2.8707 3.5557 3.6315 3.8179 3.9347 3.8326 3.9293 3.9349 3.9132 3.7497 3.5922 3.9225 4.0093 3.9768 3.9341 3.9798 4.0016 3.8180 1.0072 1.0067 0.9950 1.0107 1.0096 1.0040 0.9996 1.0016 1.0034 1.0051 1.0042 0.9965 1.0211 1.0081 1.0075 1.0061 0.9800 1.0009 0.9936 0.9784 1.0060 1.0068 0.9657
dispersion: -0.025195104 hartree
energy: -1323.210951250956 hartree
dipole: 42.85604 -41.08960 1.76644 4.32496 0.32403 4.64899 5.71128 -1.93974 3.77153
magnitude: 6.24162 au
magnitude: 15.86494 debye
