program: Orca
programVersion: 5.0.2
elementType: N C C C C C C C C C C C C C C C C C C C C C H H H H H H H H H H H H H H H H H H H H H H H H H H
charge: 1
multiplicity: 1
keywords: wb97x-d3
keywords: def2-TZVPP
keywords: def2/J RIJCOSX
keywords: DEFGRID2
keywords: scfconv7
keywords: smallprint printgap noloewdin
keywords: NOSOSCF
formula: C21H26N
InChI: InChI=1/C12H13N.C9H13/c1-13-9-11-7-4-6-10-5-2-3-8-12(10)11;1-5-6-7-8-9(2,3)4/h2-8,13H,9H2,1H3;5-6H,1H2,2-4H3
48 atoms
N  1.148015 -2.800151 -1.082411
C  1.677675 -2.672186 0.266069
C  1.311005 -1.337224 0.857868
C  1.91195 -0.131934 0.383619
C  1.472791 1.11847 0.90529
C  -3.593847 0.26548 0.584053
C  1.539974 0.896704 -2.957119
C  0.361401 -1.259117 1.839718
C  2.925522 -0.124082 -0.589236
C  -0.271261 -3.096661 -1.109808
C  0.49488 1.146453 1.917858
C  -0.043536 -0.021955 2.379812
C  2.042867 2.321474 0.409421
C  -4.773905 0.494953 -0.383461
C  -3.762964 1.149739 1.826698
C  -3.519306 -1.215057 0.973856
C  0.467549 0.449934 -2.244781
C  3.46555 1.061792 -1.049982
C  3.024852 2.298088 -0.538335
C  -2.389193 0.650012 -0.131956
C  -0.342401 1.353883 -1.559718
C  -1.425917 0.978478 -0.797814
H  2.763965 -2.780581 0.226767
H  1.32068 -3.466115 0.937876
H  2.162557 0.211138 -3.5141
H  1.737344 1.952378 -3.087911
H  -0.087646 -2.169799 2.216946
H  3.284381 -1.055509 -1.002902
H  -0.5928 -3.258206 -2.13816
H  -0.841406 -2.252395 -0.716002
H  -0.553174 -3.982476 -0.524937
H  0.183435 2.098049 2.329707
H  -0.775144 -0.004723 3.177113
H  1.710683 3.264492 0.826398
H  -4.855653 1.540232 -0.677881
H  -5.698014 0.211377 0.121166
H  -4.68038 -0.112247 -1.282933
H  -2.93999 1.015198 2.527578
H  -3.820624 2.205101 1.563443
H  -4.68654 0.878848 2.338552
H  -3.410358 -1.853416 0.097386
H  -2.682347 -1.408739 1.643932
H  -4.436357 -1.503555 1.487714
H  0.300476 -0.614067 -2.138847
H  4.276486 1.036639 -1.766979
H  3.473285 3.218098 -0.888308
H  -0.137209 2.416855 -1.653795
H  1.649999 -3.530469 -1.568587
totalener: -870.35074597 hartree
nucrepener: 1825.55173848 hartree
electener: -2695.90248446 hartree
oneelecener: -4782.93401191 hartree
twoeener: 2087.03152745 hartree
kineticenergy: 866.25030095 hartree
xcener: -89.026912419710 hartree
chargesum: 1.0000000
charge: -0.289709 -0.096112 0.060056 -0.016847 -0.047840 0.027413 -0.118207 -0.084664 -0.146616 -0.171245 -0.102747 -0.148491 -0.052244 -0.252417 -0.255341 -0.283580 -0.037069 -0.109637 -0.173317 -0.167715 -0.047703 0.274142 0.120685 0.107668 0.163874 0.149698 0.133009 0.130478 0.125446 0.040143 0.112345 0.119308 0.164194 0.135264 0.111710 0.107351 0.109215 0.093397 0.111295 0.110883 0.106537 0.094379 0.118299 0.165615 0.173920 0.154942 0.159600 0.120634
qa: -0.2897 -0.0961 0.0601 -0.0168 -0.0478 0.0274 -0.1182 -0.0847 -0.1466 -0.1712 -0.1027 -0.1485 -0.0522 -0.2524 -0.2553 -0.2836 -0.0371 -0.1096 -0.1733 -0.1677 -0.0477 0.2741 0.1207 0.1077 0.1639 0.1497 0.1330 0.1305 0.1254 0.0401 0.1123 0.1193 0.1642 0.1353 0.1117 0.1074 0.1092 0.0934 0.1113 0.1109 0.1065 0.0944 0.1183 0.1656 0.1739 0.1549 0.1596 0.1206
va: 2.8605 3.9036 3.5267 3.8003 3.7468 4.1012 3.9059 3.8466 3.8909 3.9377 3.9172 3.9149 3.8096 3.8914 3.8821 3.8968 3.6684 3.8379 3.9339 3.9640 3.9896 3.5740 0.9956 1.0069 0.9929 0.9940 1.0060 1.0290 0.9988 0.9825 1.0030 1.0180 0.9810 1.0084 1.0057 1.0047 1.0047 1.0156 1.0060 1.0068 1.0042 1.0145 1.0117 1.0179 0.9880 0.9968 0.9886 1.0262
dispersion: -0.029783510 hartree
energy: -870.380529482578 hartree
dipole: -16.71502 16.50455 -0.21047 -7.86409 8.29754 0.43345 -0.97789 -0.34196 -1.31985
magnitude: 1.40506 au
magnitude: 3.57137 debye
