program: Orca
programVersion: 5.0.2
elementType: N C C C C C C C C C C C C C C C C C C C C C H H H H H H H H H H H H H H H H H H H H H H H H H H
charge: 1
multiplicity: 1
keywords: wb97x-d3
keywords: def2-TZVPP
keywords: def2/J RIJCOSX
keywords: DEFGRID2
keywords: scfconv7
keywords: smallprint printgap noloewdin
keywords: NOSOSCF
formula: C21H26N
InChI: InChI=1/C21H26N/c1-21(2,3)15-8-5-9-16-22(4)17-19-13-10-12-18-11-6-7-14-20(18)19/h5-7,9-14,22H,16-17H2,1-4H3
48 atoms
N  2.273455 -1.172015 -0.308486
C  1.801765 -0.751306 1.066578
C  2.240942 0.642358 1.37634
C  1.642704 1.74322 0.69811
C  2.151264 3.045367 0.945288
C  -4.855528 -1.950978 -1.025643
C  1.551954 -2.405257 -0.809491
C  3.246223 0.855884 2.284857
C  0.565409 1.605472 -0.210611
C  3.747183 -1.337977 -0.364327
C  3.193422 3.21805 1.884347
C  3.720955 2.151537 2.553504
C  1.596764 4.147347 0.257732
C  -5.473521 -3.195492 -1.678229
C  -5.03771 -0.733873 -1.940478
C  -5.516032 -1.690963 0.334827
C  0.12601 -2.1230 -1.116352
C  0.047123 2.694631 -0.85793
C  0.574324 3.97841 -0.632874
C  -3.427856 -2.188205 -0.819354
C  -0.883932 -2.619042 -0.389545
C  -2.249642 -2.382063 -0.648267
H  2.215302 -1.474009 1.770519
H  0.717627 -0.860067 1.070321
H  2.093875 -2.734112 -1.697797
H  1.668742 -3.170115 -0.04042
H  3.684595 0.015735 2.810986
H  0.091092 0.642834 -0.369579
H  4.032966 -2.180463 0.261288
H  4.228857 -0.433457 -0.004829
H  4.04887 -1.529379 -1.390735
H  3.565722 4.216984 2.073575
H  4.507535 2.293636 3.281098
H  1.991578 5.136458 0.452321
H  -5.357044 -4.075888 -1.047022
H  -5.017832 -3.407129 -2.645184
H  -6.540296 -3.032762 -1.836546
H  -4.576439 -0.896249 -2.914513
H  -6.100378 -0.547337 -2.099311
H  -4.602276 0.163327 -1.50038
H  -5.398815 -2.543084 1.003676
H  -5.090822 -0.813872 0.822604
H  -6.583617 -1.514816 0.197691
H  -0.087319 -1.522467 -1.994474
H  -0.784415 2.569344 -1.538276
H  0.156918 4.829818 -1.152214
H  -0.660511 -3.252634 0.466423
H  2.030479 -0.402263 -0.938386
totalener: -870.41780646 hartree
nucrepener: 1664.17790962 hartree
electener: -2534.59571607 hartree
oneelecener: -4460.18975924 hartree
twoeener: 1925.59404317 hartree
kineticenergy: 866.24343764 hartree
xcener: -89.073893542692 hartree
chargesum: 1.0000000
charge: 0.155538 -0.193150 0.042994 -0.084889 -0.048348 -0.024667 -0.103332 -0.140277 -0.255629 -0.196019 -0.077188 -0.092380 -0.036821 -0.253415 -0.258961 -0.255247 -0.189854 -0.120211 -0.113795 -0.138585 -0.190446 0.210170 0.143697 0.198178 0.145448 0.135078 0.128062 0.178491 0.131431 0.156081 0.136737 0.131497 0.146991 0.129245 0.101167 0.100080 0.098313 0.097372 0.099863 0.091009 0.100397 0.095229 0.098778 0.142571 0.139095 0.146022 0.125522 0.168158
qa: 0.1555 -0.1931 0.0430 -0.0849 -0.0483 -0.0247 -0.1033 -0.1403 -0.2556 -0.1960 -0.0772 -0.0924 -0.0368 -0.2534 -0.2590 -0.2552 -0.1899 -0.1202 -0.1138 -0.1386 -0.1904 0.2102 0.1437 0.1982 0.1454 0.1351 0.1281 0.1785 0.1314 0.1561 0.1367 0.1315 0.1470 0.1292 0.1012 0.1001 0.0983 0.0974 0.0999 0.0910 0.1004 0.0952 0.0988 0.1426 0.1391 0.1460 0.1255 0.1682
va: 3.5797 3.8155 3.4336 3.9790 4.0368 4.1316 3.8420 3.9895 3.9580 3.8617 3.9918 3.9804 3.9225 3.8957 3.8993 3.8976 3.7943 4.0690 3.9937 3.9672 4.0531 3.7045 1.0092 0.9720 0.9986 1.0034 1.0086 0.9864 0.9960 0.9923 0.9989 1.0095 0.9981 1.0101 1.0077 1.0072 1.0062 1.0073 1.0081 1.0077 1.0079 1.0074 1.0069 1.0104 1.0038 0.9975 1.0002 1.0103
dispersion: -0.021389352 hartree
energy: -870.439195808518 hartree
dipole: -14.86857 17.49500 2.62643 -13.74947 12.61120 -1.13827 -6.49525 6.21804 -0.27720
magnitude: 2.87588 au
magnitude: 7.30989 debye
