program: Orca
programVersion: 5.0.2
elementType: N C C C C C C C C C C C C C C C C C C C C C H H H H H H H H H H H H H H H H H H H H H H H H H H
charge: 1
multiplicity: 1
keywords: wb97x-d3
keywords: def2-TZVPP
keywords: def2/J RIJCOSX
keywords: DEFGRID2
keywords: scfconv7
keywords: smallprint printgap noloewdin
keywords: NOSOSCF
formula: C21H26N
InChI: InChI=1/C21H26N/c1-21(2,3)15-8-5-9-16-22(4)17-19-13-10-12-18-11-6-7-14-20(18)19/h5-7,9-14,22H,16-17H2,1-4H3
48 atoms
N  1.931299 -1.395806 0.713769
C  1.814072 -0.37717 -0.397647
C  2.567261 0.876888 -0.085705
C  1.916761 2.033957 0.43243
C  2.715458 3.167083 0.748202
C  -4.916287 -2.287313 -1.34611
C  1.259732 -2.706247 0.346987
C  3.92474 0.886499 -0.298324
C  0.520589 2.125164 0.645367
C  1.473013 -0.883438 2.030842
C  4.110307 3.12198 0.53273
C  4.70765 2.008979 0.014034
C  2.101875 4.328124 1.270233
C  -5.594947 -3.372673 -0.49998
C  -5.26925 -2.474657 -2.826664
C  -5.365387 -0.898475 -0.87136
C  -0.219733 -2.589392 0.266192
C  -0.043724 3.264625 1.148142
C  0.752575 4.378732 1.470178
C  -3.467661 -2.393618 -1.181058
C  -0.872052 -2.57327 -0.904046
C  -2.273338 -2.483312 -1.036215
H  0.751586 -0.22438 -0.567612
H  2.219403 -0.863377 -1.286029
H  1.692413 -3.017909 -0.604261
H  1.567228 -3.424608 1.108993
H  4.410096 0.019195 -0.734728
H  -0.133543 1.30066 0.393191
H  0.432465 -0.582882 1.9596
H  2.075714 -0.027071 2.31661
H  1.579263 -1.671896 2.772028
H  4.70411 3.994196 0.775396
H  5.773223 1.988747 -0.165721
H  2.721532 5.183962 1.505944
H  -5.287486 -4.370736 -0.810601
H  -6.677346 -3.303158 -0.61456
H  -5.360484 -3.257612 0.558061
H  -6.348375 -2.392423 -2.961375
H  -4.79404 -1.715907 -3.448031
H  -4.958679 -3.454256 -3.189019
H  -4.891814 -0.106482 -1.451387
H  -6.445112 -0.802479 -0.991296
H  -5.128871 -0.741376 0.180897
H  -0.782016 -2.568805 1.191914
H  -1.114581 3.313727 1.2923
H  0.291812 5.272731 1.866851
H  -0.305234 -2.639241 -1.830623
H  2.928797 -1.593497 0.81041
totalener: -870.41376419 hartree
nucrepener: 1647.69882405 hartree
electener: -2518.11258824 hartree
oneelecener: -4427.36617469 hartree
twoeener: 1909.25358645 hartree
kineticenergy: 866.25061446 hartree
xcener: -89.074962546156 hartree
chargesum: 1.0000000
charge: 0.215401 -0.214140 0.042076 -0.085364 -0.018253 -0.023382 -0.149780 -0.159602 -0.187805 -0.241793 -0.060113 -0.128004 -0.048098 -0.252584 -0.253433 -0.258871 -0.162566 -0.111891 -0.107396 -0.143254 -0.181130 0.211464 0.171229 0.160019 0.146270 0.157000 0.132098 0.120547 0.134331 0.161593 0.152822 0.130447 0.146626 0.127442 0.101979 0.099162 0.094155 0.097973 0.096789 0.100325 0.097175 0.100680 0.093516 0.137380 0.140318 0.145166 0.122191 0.151287
qa: 0.2154 -0.2141 0.0421 -0.0854 -0.0183 -0.0234 -0.1498 -0.1596 -0.1878 -0.2418 -0.0601 -0.1280 -0.0481 -0.2526 -0.2534 -0.2589 -0.1626 -0.1119 -0.1074 -0.1433 -0.1811 0.2115 0.1712 0.1600 0.1463 0.1570 0.1321 0.1205 0.1343 0.1616 0.1528 0.1304 0.1466 0.1274 0.1020 0.0992 0.0942 0.0980 0.0968 0.1003 0.0972 0.1007 0.0935 0.1374 0.1403 0.1452 0.1222 0.1513
va: 3.5562 3.8661 3.4315 3.8639 3.9948 4.1340 3.8623 4.0045 3.9501 3.8946 3.9838 4.0219 3.9323 3.8931 3.8954 3.8966 3.7464 4.0355 3.9796 3.9582 4.0314 3.7046 0.9896 0.9973 1.0027 0.9984 1.0057 1.0087 0.9922 0.9888 0.9941 1.0096 0.9995 1.0110 1.0076 1.0066 1.0084 1.0069 1.0080 1.0079 1.0072 1.0077 1.0077 1.0116 0.9996 0.9975 1.0021 1.0084
dispersion: -0.021195767 hartree
energy: -870.434959959838 hartree
dipole: -20.09154 22.10556 2.01403 -14.93168 13.59520 -1.33647 -1.92972 2.87980 0.95009
magnitude: 2.59714 au
magnitude: 6.60140 debye
