program: Orca
programVersion: 5.0.2
elementType: N C C C C C C C C C C C C C C C C C C C C C H H H H H H H H H H H H H H H H H H H H H H H H H H
charge: 1
multiplicity: 1
keywords: wb97x-d3
keywords: def2-TZVPP
keywords: def2/J RIJCOSX
keywords: DEFGRID2
keywords: scfconv7
keywords: smallprint printgap noloewdin
keywords: NOSOSCF
formula: C21H26N
InChI: InChI=1/C12H13N.C9H13/c1-13-9-11-7-4-6-10-5-2-3-8-12(10)11;1-5-6-7-8-9(2,3)4/h2-8,13H,9H2,1H3;5-6H,1H2,2-4H3
48 atoms
N  -0.799421 -2.210005 2.451462
C  -0.137799 -0.936703 2.313498
C  0.653387 -0.820518 1.03343
C  1.515636 0.285607 0.820643
C  2.290237 0.350359 -0.376262
C  -3.001896 -1.099266 -1.222376
C  1.132382 3.629865 -1.084616
C  0.550766 -1.778878 0.050418
C  1.651747 1.337624 1.764934
C  -1.725133 -2.250752 3.566883
C  2.161359 -0.675521 -1.349267
C  1.304343 -1.712547 -1.138279
C  3.17566 1.426041 -0.568907
C  -2.630269 -2.413889 -1.91864
C  -4.166599 -0.418862 -1.978474
C  -3.396947 -1.345158 0.238815
C  0.135627 2.755607 -0.797385
C  2.492774 2.386559 1.538725
C  3.260127 2.440514 0.35235
C  -1.895534 -0.164083 -1.292893
C  -0.054302 1.626401 -1.608909
C  -1.033099 0.688406 -1.421494
H  0.519655 -0.710625 3.167595
H  -0.908128 -0.156211 2.320662
H  1.299612 4.51266 -0.484303
H  1.745664 3.52013 -1.968788
H  -0.109101 -2.620312 0.213887
H  1.086157 1.310421 2.686014
H  -2.558838 -1.571513 3.380782
H  -1.281218 -1.976441 4.532097
H  -2.13814 -3.253488 3.659471
H  2.765929 -0.629675 -2.246893
H  1.202981 -2.497845 -1.875122
H  3.791675 1.448632 -1.460034
H  -2.327453 -2.25111 -2.952316
H  -3.495981 -3.076155 -1.920615
H  -1.822099 -2.925757 -1.398183
H  -3.917501 -0.231252 -3.022122
H  -5.028041 -1.086766 -1.950053
H  -4.453636 0.522915 -1.512982
H  -2.587172 -1.815221 0.798082
H  -3.675379 -0.416036 0.736264
H  -4.260589 -2.010261 0.266711
H  -0.493293 2.895035 0.070837
H  2.588695 3.174826 2.273165
H  3.959731 3.252816 0.202468
H  0.576556 1.511785 -2.486247
H  -0.107574 -2.940748 2.563782
totalener: -870.35080907 hartree
nucrepener: 1810.41873974 hartree
electener: -2680.76954881 hartree
oneelecener: -4752.73785465 hartree
twoeener: 2071.96830584 hartree
kineticenergy: 866.24279830 hartree
xcener: -89.029055234666 hartree
chargesum: 1.0000000
charge: -0.267901 -0.082067 0.159138 -0.069237 0.074827 0.040634 -0.111593 -0.267340 -0.200897 -0.181270 -0.137942 -0.056538 -0.132912 -0.263356 -0.260236 -0.276628 -0.035424 -0.110250 -0.126863 -0.081579 -0.084552 0.251354 0.115359 0.097782 0.158223 0.142043 0.165182 0.135931 0.084229 0.099796 0.111500 0.131118 0.138674 0.131152 0.110868 0.112086 0.096076 0.113718 0.108572 0.111438 0.097278 0.105847 0.113605 0.144699 0.148900 0.167699 0.160784 0.118077
qa: -0.2679 -0.0821 0.1591 -0.0692 0.0748 0.0406 -0.1116 -0.2673 -0.2009 -0.1813 -0.1379 -0.0565 -0.1329 -0.2634 -0.2602 -0.2766 -0.0354 -0.1102 -0.1269 -0.0816 -0.0846 0.2514 0.1154 0.0978 0.1582 0.1420 0.1652 0.1359 0.0842 0.0998 0.1115 0.1311 0.1387 0.1312 0.1109 0.1121 0.0961 0.1137 0.1086 0.1114 0.0973 0.1058 0.1136 0.1447 0.1489 0.1677 0.1608 0.1181
va: 2.9195 3.8988 3.4924 3.8906 3.5783 4.0963 3.9073 3.8929 3.9688 3.9301 3.9445 3.9432 3.8741 3.8844 3.8948 3.8844 3.6895 3.9300 3.8256 3.8952 4.0291 3.6510 0.9927 0.9829 0.9940 0.9994 1.0272 1.0115 0.9939 0.9942 0.9984 1.0102 1.0028 1.0131 1.0047 1.0087 1.0130 1.0046 1.0046 1.0046 1.0232 1.0047 1.0122 1.0081 0.9997 0.9903 0.9834 1.0201
dispersion: -0.028422733 hartree
energy: -870.379231805451 hartree
dipole: -18.12084 17.96697 -0.15387 -7.59711 9.09264 1.49553 3.30261 -4.14013 -0.83752
magnitude: 1.72097 au
magnitude: 4.37435 debye
