program: Gaussian 09
title: 000071227
version: EM64L-G09RevD.01
frameworkgroup: C1[X(C25H29N3O3)]
method: RPBEPBE
basis: SDD
operation: Freq
keyword: #p
keyword: freq=noraman
keyword: PBEPBE/SDD
title: #p freq=noraman PBEPBE/SDD
converged: YES YES NO NO
title: Mulliken charges:
elementType: O O O N N N C C C C C C C C C C C C C C C C C C C C C C C C C H H H H H H H H H H H H H H H H H H H H H H H H H H H H H
charge: -0.442499 -0.322092 -0.267911 -0.364552 -0.214337 -0.454643 0.321771 -0.397688 -0.464712 -0.762344 -0.738009 -0.435903 -0.139182 0.286004 0.140179 0.261019 -0.303353 -0.349331 -0.325887 -0.229183 -0.224475 0.276171 0.144946 0.453412 -0.387031 -0.357769 -0.458343 -0.237841 -0.446130 -0.240051 -0.279215 0.217614 0.252130 0.225507 0.260979 0.248327 0.216674 0.231577 0.208421 0.215123 0.207047 0.236670 0.237964 0.227096 0.213550 0.235717 0.232167 0.344840 0.233965 0.230335 0.350220 0.221487 0.222886 0.253592 0.259141 0.236516 0.223683 0.240946 0.239704 0.235101
chargesum: 0.00000
title: Mulliken charges with hydrogens summed into heavy atoms:
elementType: O O O N N N C C C C C C C C C C C C C C C C C C C C C C C C C
charge: -0.092279 -0.322092 -0.267911 -0.116225 -0.214337 -0.109802 0.321771 0.072056 0.021773 -0.105672 -0.079168 0.029156 0.074368 0.286004 0.140179 0.261019 0.164531 -0.115367 -0.095552 -0.007696 -0.001589 0.276171 0.144946 0.453412 -0.133439 -0.098628 -0.221827 -0.014157 -0.205184 -0.000347 -0.044115
polarizability: 3.46283585e+02 8.37817307e+00 2.20090795e+02 1.20071676e+01 -3.13415928e+01 3.02264671e+02
1716.lowfreq: -0.0005 0.0005 0.0007 2.7464 5.5562 6.6922 17.5227 22.6775 27.4163
frequency: 16.3792 22.4993 27.3435 33.1225 36.2027 53.6291 58.3232 78.0002 82.3326 99.0885 116.3816 134.4300 149.1575 163.5228 174.9756 185.8571 188.6648 217.4785 237.5053 241.8138 253.0216 260.1568 264.4308 279.0383 297.0141 302.6918 322.8296 346.1399 362.2737 380.9734 406.9751 417.8437 419.4750 429.4741 434.6566 464.8516 471.4573 475.5039 492.4590 501.7001 512.5449 519.6807 563.8090 567.1782 570.9231 572.4041 582.0362 600.2916 627.2470 639.7722 645.8566 678.4706 705.4699 731.5275 736.5312 740.7859 741.4845 743.9283 765.0738 775.9129 782.8916 783.1974 804.6933 832.9093 841.5155 848.7645 865.6441 867.3449 885.9841 890.8521 903.1620 913.1845 916.3928 919.2102 941.0500 961.1135 961.7839 969.5845 974.6640 981.8973 989.6366 996.3225 1015.2224 1020.1169 1036.2436 1044.5739 1051.9275 1078.2572 1087.7296 1089.4927 1096.5577 1120.2083 1137.8654 1147.2999 1158.4564 1169.1480 1170.1226 1170.9323 1186.7266 1190.4678 1208.4508 1223.6298 1231.1396 1238.0195 1243.3370 1246.6065 1259.1824 1267.8301 1270.8066 1297.2168 1315.8355 1327.6921 1334.6659 1339.3342 1349.8009 1358.7018 1362.6793 1372.2530 1375.9740 1377.4740 1379.2396 1395.4233 1403.8519 1425.8135 1426.6037 1437.8206 1447.1462 1447.5849 1455.1837 1461.0452 1462.1290 1469.3664 1470.9894 1474.9385 1479.7452 1487.1580 1490.2367 1495.6556 1516.3481 1583.0480 1595.5315 1613.6367 1634.3174 1634.8287 1670.2702 2951.2970 2970.8986 2975.0072 2983.0915 2993.8179 3016.5940 3033.0452 3051.4289 3057.1244 3061.0247 3065.4137 3067.4995 3077.3368 3085.8365 3087.0503 3118.9414 3129.0860 3132.3916 3140.5819 3143.3456 3151.0313 3155.3648 3157.5198 3169.7754 3173.6938 3179.3839 3430.5672 3534.6898 3585.1463
redmass: 5.6923 5.8725 5.5091 6.0992 4.3161 5.1345 5.9282 2.6747 5.0049 4.2021 3.2170 6.2068 4.7650 3.9235 3.7952 4.4488 4.2431 1.2997 2.5802 1.6734 1.6075 1.7461 4.2655 4.5332 4.4563 3.1884 5.4988 2.8468 3.6045 2.4528 1.6202 1.7955 2.9595 3.1508 3.1569 2.9798 3.3433 4.7297 5.6639 3.4306 3.1797 6.4188 1.6930 4.1469 3.0024 2.6493 2.8657 4.8873 2.1051 3.3161 3.0144 6.1842 6.8672 4.6113 4.4383 1.4400 3.8278 1.3327 1.3185 3.3290 3.7495 1.9908 1.7680 4.0286 1.4190 3.0119 1.6621 3.4645 2.1974 1.6160 2.3952 1.3915 2.7560 1.8022 2.9627 1.3428 1.3049 1.9352 1.3650 1.4993 1.3276 1.8789 1.9772 2.6561 2.1770 2.2699 2.7093 2.3643 2.2314 2.5702 3.0586 1.9351 2.5767 1.4363 2.3269 1.1839 1.5986 1.0820 1.2833 1.8420 2.3445 1.6081 1.8042 1.7876 1.5620 1.4789 1.4876 1.7818 1.6990 1.5511 1.7973 1.3137 1.9569 1.5975 1.3016 2.0145 1.4477 1.4024 1.5499 1.8690 1.4235 1.2186 3.1072 5.8289 2.9293 2.2547 1.4114 1.3248 1.1312 1.0542 1.4605 2.2292 1.1241 1.2105 1.0773 1.0929 1.0942 3.6782 3.9113 7.0289 5.6061 6.9214 7.0398 7.8160 8.7444 1.0684 1.0362 1.0368 1.0555 1.0600 1.0601 1.0851 1.0994 1.1079 1.0984 1.0926 1.0981 1.0997 1.1045 1.0996 1.0865 1.0863 1.0849 1.0925 1.0897 1.0945 1.0953 1.0930 1.1003 1.0953 1.0975 1.0742 1.0654 1.0812
irintensity: 0.1475 0.0460 0.3405 0.5722 0.6483 0.6970 0.4910 0.0579 1.2227 1.4524 0.5194 1.8735 0.1833 9.2351 1.4270 0.3629 1.3659 1.4622 4.1038 1.4671 0.5200 3.0950 0.9321 2.0554 3.4240 1.5746 5.8965 2.2375 1.1219 4.1674 37.5678 87.2480 7.9524 10.1164 25.8079 9.5267 0.0065 5.3466 6.7644 17.1864 7.3120 1.2422 106.7182 11.3396 13.3067 52.9313 40.6349 10.8696 34.7172 1.6130 26.3910 14.9880 3.6433 6.8964 7.3653 45.5540 0.3077 95.9621 7.8256 2.4305 16.7219 69.5666 80.2098 14.1584 0.6581 9.0959 3.5138 0.1270 3.6682 5.6761 2.5055 5.7812 24.6627 6.2083 19.5497 0.4188 0.0256 0.5890 5.2809 0.1498 0.9744 45.5745 12.8128 18.3213 0.9789 22.2766 58.1438 31.0086 40.9090 11.5327 32.0479 11.1130 15.3085 3.2556 66.1464 13.3107 40.6679 4.6277 18.4941 10.0008 21.1510 32.4679 59.1932 59.6020 16.6899 2.9194 13.4707 31.1894 13.7798 8.2195 20.9341 13.9015 35.9437 10.7834 7.1239 36.8603 34.8827 34.2657 4.3898 47.8381 20.3807 22.7093 25.2729 26.4278 10.4623 12.8821 46.2657 12.8146 4.2189 2.3020 6.0226 2.4793 6.4912 6.3849 14.2746 2.8040 17.2777 120.8629 21.7433 66.5971 7.1563 20.9524 5.7488 18.7254 455.3902 51.5012 24.3096 38.2205 22.9053 8.2450 35.2346 25.4759 1.7459 21.2984 4.7908 20.7347 81.7547 35.3223 13.7160 37.2285 2.6081 0.8256 0.0900 17.1784 12.4063 26.6640 25.8150 18.0982 16.2368 13.6039 7.7793 2.4040 10.3696 93.7927
temp: 298.150 k
press: 1.00000 atm
elementType: 8 8 8 7 7 7 6 6 6 6 6 6 6 6 6 6 6 6 6 6 6 6 6 6 6 6 6 6 6 6 6 1 1 1 1 1 1 1 1 1 1 1 1 1 1 1 1 1 1 1 1 1 1 1 1 1 1 1 1 1
symmnumber: 1
zpe: 1296514.4 jmol-1
zpe.correction: 0.493816 hartree
zpe.thermalcorrener: 0.522522 hartree
zpe.thermalcorrenthalpy: 0.523466 hartree
zpe.thermalcorrgfe: 0.433316 hartree
zpe.sumelectzpe: -1357.748525 hartree
zpe.sumelectthermal: -1357.719819 hartree
zpe.sumelectthermalent: -1357.718875 hartree
zpe.sumelectthermalfe: -1357.809025 hartree
dipole: -0.5604 2.1921 -3.1126
dipole: 3.8481
quadrupole: -164.4739 -192.8667 -181.1321
quadrupole: 16.2550 -4.6032 -4.7258
quadrupole: 15.0170 -13.3758 -1.6412 16.2550 -4.6032 -4.7258
hfenergy: -1358.2423409 hartree
pointgroup: C01 [X(C25H29N3O3)]
dipole: -0.3082236 -0.2162025 -1.4663828 debye
polarizability: 245.3311959|58.6158111|315.5644779|-14.1763883|13.4470263|307.743376 unknown
InChI: InChI=1S/C25H29N3O3/c1-25(2,14-15-28-22-12-6-5-11-21(22)27-24(28)30)26-16-19(29)17-31-23-13-7-9-18-8-3-4-10-20(18)23/h3-13,19,26-27,29H,14-17H2,1-2H3
charge 0 multiplicity 1
60 atoms
O  4.687225 1.489251 1.383537
O  2.545172 -0.154671 0.546281
O  -1.697585 1.351091 1.91984
N  2.345879 3.154429 -1.082714
N  -2.079559 1.130387 -0.436987
N  -2.528283 -0.646606 0.863105
C  0.896015 3.541578 -1.174122
C  0.069806 2.244499 -0.933386
C  -1.464375 2.411198 -0.811899
C  0.673375 4.059343 -2.616448
C  0.524018 4.659152 -0.154495
C  2.905399 2.789921 0.24025
C  4.00625 1.70824 0.097547
C  -2.505643 0.093087 -1.288418
C  -2.062433 0.684996 0.911656
C  -2.79636 -1.037731 -0.460224
C  3.475889 0.388016 -0.469611
C  -2.669553 0.032108 -2.683417
C  -3.257393 -2.24481 -1.009475
C  -3.136716 -1.186382 -3.237859
C  -3.425594 -2.304808 -2.41621
C  1.943958 -1.3973 0.289881
C  1.027989 -1.863527 1.305064
C  0.382544 -3.14611 1.111025
C  2.191896 -2.158266 -0.859061
C  0.733353 -1.100635 2.479792
C  0.660596 -3.912026 -0.070167
C  1.543192 -3.420597 -1.030079
C  -0.528629 -3.615234 2.114797
C  -0.161618 -1.584613 3.439156
C  -0.795705 -2.854827 3.258333
H  0.302703 1.533087 -1.7490
H  0.408403 1.773068 0.007043
H  -1.925118 2.766372 -1.750817
H  -1.709106 3.129117 -0.010516
H  2.934044 3.851868 -1.559779
H  -0.385615 4.321356 -2.788108
H  0.971044 3.289411 -3.350838
H  1.27263 4.971226 -2.806944
H  -0.506249 5.029911 -0.307666
H  1.208405 5.520597 -0.271789
H  0.598312 4.29671 0.886726
H  3.353838 3.64543 0.78929
H  2.104118 2.383262 0.881365
H  4.798564 2.077181 -0.579829
H  2.936329 0.574562 -1.417339
H  4.306716 -0.328134 -0.619969
H  -2.496588 -1.251742 1.682876
H  -2.443932 0.890108 -3.324775
H  -3.476366 -3.111446 -0.377346
H  4.08239 0.937719 1.945783
H  -3.274696 -1.262987 -4.321728
H  -3.783709 -3.233114 -2.873843
H  2.876428 -1.804199 -1.633922
H  1.199866 -0.120486 2.607139
H  0.167451 -4.880674 -0.207946
H  1.750742 -4.000588 -1.935796
H  -1.006255 -4.592512 1.973771
H  -0.386583 -0.983266 4.32559
H  -1.481975 -3.233187 4.024576
