program: Orca
programVersion: 5.0.2
elementType: N C C C C C C C C C C C C C C C C C C C C C H H H H H H H H H H H H H H H H H H H H H H H H H H
charge: 1
multiplicity: 1
keywords: wb97x-d3
keywords: def2-TZVPP
keywords: def2/J RIJCOSX
keywords: DEFGRID2
keywords: scfconv7
keywords: smallprint printgap noloewdin
keywords: NOSOSCF
formula: C21H26N
InChI: InChI=1/C21H26N/c1-21(2,3)15-8-5-9-16-22(4)17-19-13-10-12-18-11-6-7-14-20(18)19/h5-7,9-14,22H,16-17H2,1-4H3
48 atoms
N  2.235447 -1.195594 -0.23869
C  1.78678 -0.686285 1.114252
C  2.269653 0.707658 1.346907
C  1.692196 1.791077 0.624216
C  2.242229 3.088149 0.799883
C  -4.919709 -2.023047 -0.968586
C  1.487036 -2.443421 -0.655504
C  3.295827 0.935376 2.228393
C  0.596144 1.641369 -0.259886
C  3.705095 -1.39222 -0.300258
C  3.30541 3.27539 1.712278
C  3.813424 2.227598 2.424784
C  1.707528 4.171967 0.06906
C  -5.174046 -2.050231 -2.481303
C  -5.334766 -0.661957 -0.392179
C  -5.708123 -3.144824 -0.280452
C  0.065459 -2.157169 -0.978115
C  0.097543 2.713533 -0.949798
C  0.664531 3.990774 -0.794849
C  -3.492941 -2.222291 -0.719573
C  -0.95146 -2.601705 -0.228264
C  -2.315016 -2.385144 -0.515847
H  2.183695 -1.382593 1.853557
H  0.699948 -0.763582 1.129431
H  2.018125 -2.841227 -1.521938
H  1.592522 -3.15902 0.161149
H  3.718269 0.109301 2.788886
H  0.093275 0.685889 -0.366424
H  3.990794 -1.653022 -1.315868
H  3.982719 -2.198971 0.374123
H  4.207099 -0.476357 -0.003095
H  3.709698 4.270957 1.846086
H  4.61612 2.38153 3.132233
H  2.134589 5.156999 0.208796
H  -4.620088 -1.263435 -2.993227
H  -6.235722 -1.897132 -2.678663
H  -4.886284 -3.007225 -2.915837
H  -5.157448 -0.612138 0.681938
H  -4.791325 0.15522 -0.866459
H  -6.399801 -0.5024 -0.564791
H  -5.428796 -4.123812 -0.669028
H  -5.540862 -3.145742 0.796409
H  -6.775756 -3.00592 -0.455218
H  -0.139561 -1.611187 -1.893046
H  -0.749136 2.580726 -1.609717
H  0.262056 4.828343 -1.347588
H  -0.7368 -3.182241 0.666829
H  1.998073 -0.460849 -0.911021
totalener: -870.41781395 hartree
nucrepener: 1659.91613890 hartree
electener: -2530.33395285 hartree
oneelecener: -4451.68945981 hartree
twoeener: 1921.35550696 hartree
kineticenergy: 866.23819903 hartree
xcener: -89.072634240563 hartree
chargesum: 1.0000000
charge: 0.158665 -0.197628 0.044841 -0.083984 -0.047345 -0.028649 -0.103084 -0.141509 -0.252192 -0.197336 -0.076083 -0.093224 -0.037587 -0.253091 -0.256059 -0.254011 -0.191209 -0.121082 -0.113378 -0.140312 -0.187521 0.211400 0.143655 0.198455 0.145077 0.135060 0.128258 0.175557 0.136470 0.131953 0.156679 0.131505 0.147196 0.129109 0.091646 0.098860 0.101667 0.100299 0.092122 0.099939 0.100679 0.097926 0.097958 0.142138 0.139001 0.146544 0.124965 0.167664
qa: 0.1587 -0.1976 0.0448 -0.0840 -0.0473 -0.0286 -0.1031 -0.1415 -0.2522 -0.1973 -0.0761 -0.0932 -0.0376 -0.2531 -0.2561 -0.2540 -0.1912 -0.1211 -0.1134 -0.1403 -0.1875 0.2114 0.1437 0.1985 0.1451 0.1351 0.1283 0.1756 0.1365 0.1320 0.1567 0.1315 0.1472 0.1291 0.0916 0.0989 0.1017 0.1003 0.0921 0.0999 0.1007 0.0979 0.0980 0.1421 0.1390 0.1465 0.1250 0.1677
va: 3.5774 3.8189 3.4262 3.9782 4.0358 4.1368 3.8396 3.9887 3.9608 3.8628 3.9903 3.9807 3.9242 3.8932 3.8968 3.8959 3.7935 4.0713 3.9930 3.9653 4.0544 3.7072 1.0094 0.9714 0.9984 1.0036 1.0084 0.9875 0.9992 0.9957 0.9918 1.0095 0.9980 1.0101 1.0087 1.0072 1.0073 1.0073 1.0079 1.0071 1.0077 1.0080 1.0066 1.0108 1.0036 0.9973 1.0003 1.0103
dispersion: -0.021291171 hartree
energy: -870.439105124068 hartree
dipole: -15.31312 17.90724 2.59412 -14.30164 13.13550 -1.16614 -6.04720 5.82785 -0.21935
magnitude: 2.85262 au
magnitude: 7.25079 debye
