program: Orca
programVersion: 5.0.2
elementType: N C C C C C C C C C C C C C C C C C C C C C H H H H H H H H H H H H H H H H H H H H H H H H H H
charge: 1
multiplicity: 1
keywords: wb97x-d3
keywords: def2-TZVPP
keywords: def2/J RIJCOSX
keywords: DEFGRID2
keywords: scfconv7
keywords: smallprint printgap noloewdin
keywords: NOSOSCF
formula: C21H26N
InChI: InChI=1/C12H13N.C9H13/c1-13-9-11-7-4-6-10-5-2-3-8-12(10)11;1-5-6-7-8-9(2,3)4/h2-8,13H,9H2,1H3;5-6H,1H2,2-4H3
48 atoms
N  1.73592 -2.737581 1.886062
C  2.574071 -2.561839 0.706561
C  1.983398 -1.527193 -0.210075
C  1.96685 -0.153314 0.163205
C  1.329339 0.790588 -0.682153
C  -3.721827 1.027809 -1.838638
C  0.382176 0.280374 2.88542
C  1.409322 -1.897553 -1.400069
C  2.538211 0.313138 1.368166
C  2.365447 -3.564922 2.903608
C  0.768436 0.365277 -1.904288
C  0.811941 -0.95396 -2.256969
C  1.26836 2.153049 -0.284469
C  -5.141758 0.935033 -1.249606
C  -3.573881 0.064409 -3.023057
C  -3.427197 2.470434 -2.275966
C  -0.599756 0.773685 2.061945
C  2.477595 1.648731 1.717397
C  1.83297 2.579505 0.882144
C  -2.783908 0.656121 -0.793058
C  -1.049362 -0.015051 1.013859
C  -1.995109 0.361079 0.081486
H  2.731879 -3.497136 0.153135
H  3.567746 -2.24799 1.038733
H  0.727536 0.847691 3.73872
H  0.742342 -0.741136 2.785035
H  1.424348 -2.939345 -1.696368
H  3.066416 -0.372075 2.016458
H  1.67618 -3.71668 3.732551
H  3.245689 -3.05614 3.298652
H  2.685461 -4.549297 2.542909
H  0.307437 1.095815 -2.55724
H  0.38682 -1.282366 -3.195768
H  0.777937 2.861839 -0.940556
H  -5.375115 -0.076549 -0.919907
H  -5.859984 1.212294 -2.021702
H  -5.272475 1.612517 -0.406942
H  -2.566798 0.096931 -3.43904
H  -3.790295 -0.962874 -2.732239
H  -4.271374 0.345721 -3.812152
H  -4.135341 2.763469 -3.051259
H  -3.526371 3.169343 -1.446348
H  -2.423009 2.565289 -2.689318
H  -0.99171 1.772687 2.193198
H  2.963853 1.985846 2.623844
H  1.796105 3.62303 1.162538
H  -0.640071 -1.017875 0.918784
H  0.873042 -3.182591 1.596784
totalener: -870.35423938 hartree
nucrepener: 1771.45914197 hartree
electener: -2641.81338135 hartree
oneelecener: -4674.85275936 hartree
twoeener: 2033.03937801 hartree
kineticenergy: 866.24648549 hartree
xcener: -89.025831060855 hartree
chargesum: 1.0000000
charge: -0.311789 -0.088651 -0.058547 -0.022104 0.041567 -0.033140 -0.095109 -0.062289 -0.151126 -0.170640 -0.174884 -0.055104 -0.040159 -0.249820 -0.246277 -0.248557 -0.061383 -0.128877 -0.142754 -0.089889 -0.115169 0.289266 0.105750 0.118434 0.160999 0.163442 0.127021 0.157181 0.103512 0.093594 0.107344 0.120278 0.145017 0.125394 0.109764 0.105959 0.108834 0.088752 0.107099 0.108196 0.108504 0.107324 0.092284 0.150311 0.169945 0.148790 0.157427 0.124283
qa: -0.3118 -0.0887 -0.0585 -0.0221 0.0416 -0.0331 -0.0951 -0.0623 -0.1511 -0.1706 -0.1749 -0.0551 -0.0402 -0.2498 -0.2463 -0.2486 -0.0614 -0.1289 -0.1428 -0.0899 -0.1152 0.2893 0.1057 0.1184 0.1610 0.1634 0.1270 0.1572 0.1035 0.0936 0.1073 0.1203 0.1450 0.1254 0.1098 0.1060 0.1088 0.0888 0.1071 0.1082 0.1085 0.1073 0.0923 0.1503 0.1699 0.1488 0.1574 0.1243
va: 2.8735 3.8807 3.6785 3.6732 3.6581 4.1462 3.8058 3.9360 3.8425 3.9288 3.9397 3.9321 3.8922 3.8896 3.8922 3.8905 3.6797 3.9076 3.9446 3.9292 4.0239 3.6104 1.0059 0.9853 0.9933 1.0351 1.0087 1.0097 0.9982 0.9958 0.9948 1.0134 0.9957 1.0102 1.0056 1.0048 1.0060 1.0105 1.0064 1.0081 1.0075 1.0066 1.0087 1.0057 0.9899 0.9981 0.9899 1.0165
dispersion: -0.026864319 hartree
energy: -870.381103702956 hartree
dipole: -11.57938 10.81109 -0.76829 -3.72030 3.80181 0.08151 -1.00057 1.92297 0.92239
magnitude: 1.20322 au
magnitude: 3.05833 debye
