program: Orca
programVersion: 5.0.2
elementType: N C C C C C C C C C C C C C C C C C C C C C H H H H H H H H H H H H H H H H H H H H H H H H H H
charge: 1
multiplicity: 1
keywords: wb97x-d3
keywords: def2-TZVPP
keywords: def2/J RIJCOSX
keywords: DEFGRID2
keywords: scfconv7
keywords: smallprint printgap noloewdin
keywords: NOSOSCF
formula: C21H26N
InChI: InChI=1/C21H26N/c1-21(2,3)15-8-5-9-16-22(4)17-19-13-10-12-18-11-6-7-14-20(18)19/h5-7,9-14,22H,16-17H2,1-4H3
48 atoms
N  2.188502 -1.053577 -0.672729
C  3.3586 -0.31201 -0.06859
C  2.906699 0.690106 0.943613
C  2.13596 1.819315 0.543568
C  1.632178 2.683701 1.550835
C  -4.788993 -2.102897 -1.324078
C  1.409504 -1.861517 0.343719
C  3.202762 0.492799 2.268457
C  1.840901 2.126372 -0.806869
C  2.602763 -1.872104 -1.83685
C  1.958025 2.439124 2.904308
C  2.742025 1.379128 3.257599
C  0.824005 3.781807 1.182283
C  -5.570245 -2.898498 -0.268676
C  -4.737326 -2.887158 -2.641216
C  -5.4555 -0.739387 -1.548775
C  0.070692 -2.234084 -0.190435
C  1.056328 3.199728 -1.133069
C  0.529275 4.030134 -0.128568
C  -3.427469 -1.894458 -0.834121
C  -1.006759 -1.479175 0.066102
C  -2.305175 -1.730653 -0.423394
H  3.896817 0.145127 -0.901219
H  4.013359 -1.062857 0.374088
H  2.027316 -2.725072 0.594734
H  1.319586 -1.233701 1.228638
H  3.799414 -0.361828 2.565483
H  2.282231 1.555526 -1.617545
H  3.308219 -2.630596 -1.505846
H  3.078249 -1.235475 -2.578936
H  1.731639 -2.348402 -2.277536
H  1.580551 3.113486 3.662574
H  3.000523 1.207268 4.292931
H  0.442902 4.432514 1.959131
H  -6.590726 -3.06349 -0.616729
H  -5.619702 -2.361851 0.678352
H  -5.115376 -3.871573 -0.085269
H  -4.266013 -3.860491 -2.506294
H  -5.749539 -3.05238 -3.012242
H  -4.184497 -2.342994 -3.406854
H  -5.501845 -0.161904 -0.625794
H  -4.918433 -0.15084 -2.292466
H  -6.475527 -0.883073 -1.907235
H  -0.025474 -3.131872 -0.788516
H  0.854321 3.422584 -2.172016
H  -0.091478 4.872934 -0.398817
H  -0.897364 -0.60151 0.701233
H  1.532346 -0.343868 -1.01106
totalener: -870.41689335 hartree
nucrepener: 1666.27157766 hartree
electener: -2536.68847102 hartree
oneelecener: -4464.33638778 hartree
twoeener: 1927.64791676 hartree
kineticenergy: 866.24222768 hartree
xcener: -89.072203304662 hartree
chargesum: 1.0000000
charge: 0.155886 -0.193568 0.123588 -0.129717 -0.060273 -0.018424 -0.166636 -0.119394 -0.248937 -0.172337 -0.069863 -0.101237 -0.033488 -0.254567 -0.257043 -0.256493 -0.165429 -0.096413 -0.115503 -0.145451 -0.171319 0.204680 0.172161 0.144490 0.149658 0.164636 0.126473 0.133555 0.132347 0.131560 0.140522 0.131559 0.148243 0.129865 0.098225 0.100214 0.099629 0.096517 0.099631 0.094200 0.098886 0.094736 0.098993 0.135882 0.142102 0.147652 0.120459 0.159745
qa: 0.1559 -0.1936 0.1236 -0.1297 -0.0603 -0.0184 -0.1666 -0.1194 -0.2489 -0.1723 -0.0699 -0.1012 -0.0335 -0.2546 -0.2570 -0.2565 -0.1654 -0.0964 -0.1155 -0.1455 -0.1713 0.2047 0.1722 0.1445 0.1497 0.1646 0.1265 0.1336 0.1323 0.1316 0.1405 0.1316 0.1482 0.1299 0.0982 0.1002 0.0996 0.0965 0.0996 0.0942 0.0989 0.0947 0.0990 0.1359 0.1421 0.1477 0.1205 0.1597
va: 3.5722 3.8217 3.3527 3.9629 4.0184 4.1339 3.9012 3.9718 3.9551 3.8523 3.9809 3.9852 3.9203 3.8967 3.8977 3.8970 3.7867 4.0364 3.9975 3.9746 4.0613 3.7169 0.9806 1.0084 1.0072 0.9983 1.0098 1.0104 0.9963 0.9997 0.9998 1.0094 0.9979 1.0099 1.0063 1.0077 1.0076 1.0079 1.0076 1.0075 1.0078 1.0079 1.0070 1.0129 1.0010 0.9970 1.0025 1.0332
dispersion: -0.021230347 hartree
energy: -870.438123700100 hartree
dipole: -15.67237 18.03484 2.36247 -15.65153 14.68117 -0.97036 -11.02489 10.33991 -0.68498
magnitude: 2.64425 au
magnitude: 6.72114 debye
